program: Orca
programVersion: 5.0.2
elementType: Cl O O N C C C C C C C C C C C C C C C C C H H H H H H H H H H H H H H H H H H H H H H H H H H
charge: 0
multiplicity: 1
keywords: wb97x-d3
keywords: def2-TZVPP
keywords: def2/J RIJCOSX
keywords: DEFGRID2
keywords: scfconv7
keywords: smallprint printgap noloewdin
keywords: NOSOSCF
formula: C17H26ClNO2
InChI: InChI=1/C17H26ClNO2/c1-4-7-11-21-13-19(16(20)12-18)17-14(5-2)9-8-10-15(17)6-3/h8-10H,4-7,11-13H2,1-3H3
47 atoms
Cl -1.564258 2.914006 2.411748
O  1.871851 -0.307167 -1.135437
O  0.438422 2.435202 0.390836
N  -0.293101 0.465115 -0.458738
C  -1.2747 -0.569229 -0.452313
C  -1.101094 -1.698753 0.356043
C  -2.407888 -0.429618 -1.26674
C  0.091198 -1.898145 1.252782
C  -2.634667 0.766055 -2.155332
C  0.744974 0.425507 -1.476385
C  -2.082327 -2.68523 0.33302
C  -3.362836 -1.438966 -1.257792
C  4.047574 -0.492445 -0.180927
C  2.771784 0.321162 -0.244607
C  -3.203741 -2.561995 -0.465692
C  -0.362042 1.534837 0.397307
C  5.049994 0.101715 0.801792
C  1.03592 -2.98309 0.740783
C  -2.396468 0.455622 -3.632226
C  -1.543723 1.493495 1.362584
C  6.340589 -0.70013 0.879444
H  -0.265735 -2.172889 2.2493
H  0.64493 -0.9683 1.375013
H  -2.004037 1.603881 -1.857454
H  -3.66583 1.105317 -2.028764
H  1.00027 1.45713 -1.738274
H  0.320628 -0.067067 -2.350896
H  -1.9644 -3.559729 0.961871
H  -4.248015 -1.33501 -1.874282
H  4.494124 -0.551149 -1.177774
H  3.808983 -1.51882 0.114391
H  2.339442 0.406246 0.760246
H  2.987757 1.344732 -0.577111
H  -3.959678 -3.33623 -0.463501
H  5.277687 1.132683 0.515559
H  4.596387 0.160624 1.795619
H  1.425137 -2.723082 -0.241132
H  0.532397 -3.947005 0.662504
H  1.880811 -3.106559 1.419115
H  -2.590609 1.333319 -4.248565
H  -3.047076 -0.346873 -3.979436
H  -1.369051 0.142219 -3.815841
H  -2.487489 1.452372 0.818668
H  -1.497753 0.601574 1.987927
H  6.149698 -1.726621 1.195976
H  7.041318 -0.261864 1.589937
H  6.838553 -0.744039 -0.090147
totalener: -1328.97802034 hartree
nucrepener: 1935.51998194 hartree
electener: -3264.49800228 hartree
oneelecener: -5661.89712882 hartree
twoeener: 2397.39912654 hartree
kineticenergy: 1324.31445281 hartree
xcener: -107.427517142364 hartree
chargesum: 0.0000000
charge: -0.104213 -0.320427 -0.350534 -0.008786 0.116475 -0.164788 -0.154379 -0.176046 -0.211355 0.092902 -0.046011 -0.029733 -0.077379 -0.014794 -0.169587 0.213864 -0.088329 -0.271197 -0.229574 -0.073921 -0.260260 0.098155 0.074279 0.090879 0.094683 0.115175 0.099687 0.116562 0.116452 0.063246 0.053350 0.072944 0.095876 0.126724 0.058600 0.056733 0.094596 0.084960 0.086716 0.091778 0.079832 0.078513 0.123855 0.122047 0.072364 0.086256 0.073810
qa: -0.1042 -0.3204 -0.3505 -0.0088 0.1165 -0.1648 -0.1544 -0.1760 -0.2114 0.0929 -0.0460 -0.0297 -0.0774 -0.0148 -0.1696 0.2139 -0.0883 -0.2712 -0.2296 -0.0739 -0.2603 0.0982 0.0743 0.0909 0.0947 0.1152 0.0997 0.1166 0.1165 0.0632 0.0534 0.0729 0.0959 0.1267 0.0586 0.0567 0.0946 0.0850 0.0867 0.0918 0.0798 0.0785 0.1239 0.1220 0.0724 0.0863 0.0738
va: 1.1708 1.9852 2.1454 2.8589 3.6957 3.8707 3.8197 3.8642 3.9013 3.9613 3.8606 3.8549 3.8683 3.9133 4.0543 4.1566 3.8900 3.9100 3.9241 4.0365 3.9538 0.9979 1.0275 1.0131 0.9974 1.0052 1.0046 1.0038 1.0039 1.0190 1.0144 0.9864 1.0083 1.0021 1.0090 1.0070 1.0212 1.0121 1.0030 1.0074 1.0064 1.0081 1.0069 1.0085 1.0031 1.0053 1.0030
dispcorr: -0.026085512 hartree
energy: -1329.004105854039
dipole: 23.26496 -23.84811 -0.58315 -18.80998 17.52433 -1.28566 -11.53908 10.92230 -0.61678
magnitude: 1.54058 au
magnitude: 3.91586 debye
