program: Orca
programVersion: 5.0.2
elementType: Cl O O N C C C C C C C C C C C C C C C C C H H H H H H H H H H H H H H H H H H H H H H H H H H
charge: 0
multiplicity: 1
keywords: wb97x-d3
keywords: def2-TZVPP
keywords: def2/J RIJCOSX
keywords: DEFGRID2
keywords: scfconv7
keywords: smallprint printgap noloewdin
keywords: NOSOSCF
formula: C17H26ClNO2
InChI: InChI=1/C17H26ClNO2/c1-4-7-11-21-13-19(16(20)12-18)17-14(5-2)9-8-10-15(17)6-3/h8-10H,4-7,11-13H2,1-3H3
47 atoms
Cl -2.037287 2.536206 0.779144
O  2.005197 -1.124178 -0.973504
O  1.275704 1.797063 0.784592
N  0.115449 0.157159 -0.269619
C  -1.036569 -0.680314 -0.348088
C  -1.139459 -1.803408 0.480855
C  -2.017295 -0.383154 -1.307111
C  -0.099658 -2.167575 1.511032
C  -1.87863 0.79274 -2.243304
C  1.158947 -0.062193 -1.261776
C  -2.255035 -2.62355 0.341746
C  -3.114536 -1.229853 -1.406268
C  4.12876 0.045585 -0.51745
C  3.031854 -0.886675 -0.029686
C  -3.234476 -2.341646 -0.590694
C  0.26829 1.13466 0.671277
C  5.238489 0.189449 0.517726
C  -0.655003 -2.273128 2.929422
C  -3.18624 1.493212 -2.590624
C  -0.919721 1.399552 1.58366
C  6.374685 1.080642 0.038173
H  0.719533 -1.452785 1.50318
H  0.347815 -3.123402 1.226364
H  -1.401012 0.450267 -3.168044
H  -1.199053 1.528215 -1.81553
H  1.689883 0.881602 -1.40086
H  0.667348 -0.321658 -2.199164
H  -2.349855 -3.503044 0.96679
H  -3.888169 -1.02344 -2.133572
H  3.720175 1.037729 -0.7260
H  4.539782 -0.337338 -1.45627
H  3.457283 -1.871053 0.179819
H  2.627338 -0.50936 0.917104
H  -4.093094 -2.992911 -0.688603
H  4.818134 0.599269 1.440607
H  5.633651 -0.798449 0.774658
H  0.137041 -2.529505 3.63284
H  -1.425762 -3.03843 3.014689
H  -1.096211 -1.332006 3.259661
H  -2.985059 2.389153 -3.177246
H  -3.717925 1.795844 -1.689325
H  -3.85402 0.868361 -3.183129
H  -1.489585 0.511674 1.841659
H  -0.555987 1.880278 2.487551
H  7.152205 1.180052 0.795634
H  6.015967 2.083024 -0.199737
H  6.841337 0.676626 -0.861625
totalener: -1328.97528889 hartree
nucrepener: 1962.35664961 hartree
electener: -3291.33193850 hartree
oneelecener: -5715.73467540 hartree
twoeener: 2424.40273690 hartree
kineticenergy: 1324.30497528 hartree
xcener: -107.429490258882 hartree
chargesum: 0.0000000
charge: -0.125116 -0.322896 -0.376575 0.002685 0.067574 -0.174152 -0.064150 -0.194548 -0.230488 0.089607 -0.041190 -0.050927 -0.117210 0.005658 -0.165105 0.243549 -0.097718 -0.219400 -0.247849 -0.080073 -0.256755 0.066255 0.100728 0.088833 0.100383 0.119271 0.107359 0.114717 0.115698 0.068923 0.066514 0.094124 0.074274 0.125138 0.066398 0.052437 0.091262 0.078829 0.068394 0.089612 0.088119 0.077195 0.121018 0.146046 0.083828 0.078216 0.071509
qa: -0.1251 -0.3229 -0.3766 0.0027 0.0676 -0.1742 -0.0641 -0.1945 -0.2305 0.0896 -0.0412 -0.0509 -0.1172 0.0057 -0.1651 0.2435 -0.0977 -0.2194 -0.2478 -0.0801 -0.2568 0.0663 0.1007 0.0888 0.1004 0.1193 0.1074 0.1147 0.1157 0.0689 0.0665 0.0941 0.0743 0.1251 0.0664 0.0524 0.0913 0.0788 0.0684 0.0896 0.0881 0.0772 0.1210 0.1460 0.0838 0.0782 0.0715
va: 1.1556 2.0090 2.1217 2.8890 3.8094 3.8985 3.7644 3.9279 3.8986 3.9503 3.8498 3.8682 3.8551 3.9250 4.0590 4.1490 3.8957 3.9105 3.9342 3.9737 3.9538 1.0177 1.0026 0.9971 1.0080 0.9912 0.9998 1.0044 1.0058 1.0192 1.0163 0.9964 0.9909 1.0029 1.0070 1.0084 1.0073 1.0092 1.0088 1.0068 1.0158 1.0025 1.0185 1.0056 1.0057 1.0030 1.0027
dispcorr: -0.026613465 hartree
energy: -1329.001902354292
dipole: 21.07459 -21.44706 -0.37247 -9.61848 8.73738 -0.88110 -1.18542 1.24038 0.05496
magnitude: 0.95817 au
magnitude: 2.43548 debye
