program: Orca
programVersion: 5.0.2
elementType: Cl O O N C C C C C C C C C C C C C C C C C H H H H H H H H H H H H H H H H H H H H H H H H H H
charge: 0
multiplicity: 1
keywords: wb97x-d3
keywords: def2-TZVPP
keywords: def2/J RIJCOSX
keywords: DEFGRID2
keywords: scfconv7
keywords: smallprint printgap noloewdin
keywords: NOSOSCF
formula: C17H26ClNO2
InChI: InChI=1/C17H26ClNO2/c1-4-7-11-21-13-19(16(20)12-18)17-14(5-2)9-8-10-15(17)6-3/h8-10H,4-7,11-13H2,1-3H3
47 atoms
Cl -0.660353 1.495233 2.523083
O  2.104689 -0.477851 -0.982645
O  0.826902 2.403295 -0.258626
N  -0.091026 0.393859 -0.747941
C  -1.173112 -0.526733 -0.611321
C  -1.148996 -1.50342 0.388644
C  -2.241107 -0.435592 -1.515321
C  0.012977 -1.71333 1.321308
C  -2.286929 0.590371 -2.61847
C  1.005012 0.053709 -1.643747
C  -2.24905 -2.350524 0.502068
C  -3.311657 -1.308607 -1.371435
C  4.304849 -0.32915 -0.064273
C  3.276703 0.320238 -0.967749
C  -3.323919 -2.254578 -0.360597
C  -0.060149 1.594092 -0.100993
C  3.887051 -0.4735 1.397059
C  0.805482 -2.970189 0.96792
C  -3.099234 1.831687 -2.252496
C  -1.194661 1.897112 0.867341
C  3.550029 0.841411 2.087164
H  -0.369422 -1.795524 2.341258
H  0.681086 -0.855443 1.31672
H  -2.733141 0.126141 -3.501256
H  -1.282263 0.893318 -2.915701
H  1.273185 0.943025 -2.222693
H  0.614531 -0.700841 -2.330472
H  -2.254003 -3.099533 1.285064
H  -4.144041 -1.244359 -2.062362
H  5.213869 0.278121 -0.12477
H  4.567889 -1.311369 -0.466763
H  3.050034 1.335554 -0.631322
H  3.690929 0.400183 -1.982318
H  -4.168193 -2.922706 -0.252375
H  3.037434 -1.155357 1.466924
H  4.704223 -0.96157 1.934872
H  1.603011 -3.135883 1.693157
H  1.266555 -2.876032 -0.013901
H  0.173438 -3.859088 0.962352
H  -3.160242 2.516821 -3.097929
H  -2.652125 2.380718 -1.423757
H  -4.116171 1.567489 -1.961142
H  -1.390904 2.966604 0.836989
H  -2.113133 1.348534 0.679741
H  2.673523 1.325677 1.657153
H  4.38019 1.547775 2.023554
H  3.33907 0.68151 3.144833
totalener: -1328.97521198 hartree
nucrepener: 2014.80199833 hartree
electener: -3343.77721032 hartree
oneelecener: -5820.91704443 hartree
twoeener: 2477.13983412 hartree
kineticenergy: 1324.29840594 hartree
xcener: -107.425181080179 hartree
chargesum: 0.0000000
charge: -0.118710 -0.322710 -0.384062 0.038090 0.000520 -0.108519 -0.060589 -0.133675 -0.185760 0.065334 -0.065384 -0.040796 -0.118633 -0.030685 -0.154783 0.252424 -0.095963 -0.261911 -0.251384 -0.113458 -0.255186 0.093061 0.025336 0.087321 0.083688 0.110383 0.110766 0.117321 0.114634 0.062066 0.069118 0.104097 0.080747 0.126091 0.048936 0.072263 0.084552 0.092656 0.082045 0.094429 0.077482 0.086871 0.149630 0.132177 0.079425 0.077576 0.083168
qa: -0.1187 -0.3227 -0.3841 0.0381 0.0005 -0.1085 -0.0606 -0.1337 -0.1858 0.0653 -0.0654 -0.0408 -0.1186 -0.0307 -0.1548 0.2524 -0.0960 -0.2619 -0.2514 -0.1135 -0.2552 0.0931 0.0253 0.0873 0.0837 0.1104 0.1108 0.1173 0.1146 0.0621 0.0691 0.1041 0.0807 0.1261 0.0489 0.0723 0.0846 0.0927 0.0820 0.0944 0.0775 0.0869 0.1496 0.1322 0.0794 0.0776 0.0832
va: 1.1544 1.9716 2.1153 2.8664 3.8004 3.8768 3.8403 3.8737 3.9247 3.9639 3.8787 3.8579 3.9183 3.9021 4.0321 4.1118 3.8798 3.9184 3.9166 3.9873 3.9348 1.0059 1.0449 1.0014 1.0056 0.9966 0.9913 1.0031 1.0056 1.0132 1.0162 0.9909 0.9944 1.0015 1.0158 1.0101 1.0033 1.0174 1.0116 1.0091 1.0081 1.0031 1.0004 1.0029 1.0091 1.0060 1.0066
dispcorr: -0.029432020 hartree
energy: -1329.004644001275
dipole: 12.43504 -13.31567 -0.88064 -7.44046 6.85272 -0.58774 -7.39780 6.55933 -0.83847
magnitude: 1.35055 au
magnitude: 3.43284 debye
