program: Orca
programVersion: 5.0.2
elementType: Cl O O N C C C C C C C C C C C C C C C C C H H H H H H H H H H H H H H H H H H H H H H H H H H
charge: 0
multiplicity: 1
keywords: wb97x-d3
keywords: def2-TZVPP
keywords: def2/J RIJCOSX
keywords: DEFGRID2
keywords: scfconv7
keywords: smallprint printgap noloewdin
keywords: NOSOSCF
formula: C17H26ClNO2
InChI: InChI=1/C17H26ClNO2/c1-4-7-11-21-13-19(16(20)12-18)17-14(5-2)9-8-10-15(17)6-3/h8-10H,4-7,11-13H2,1-3H3
47 atoms
Cl -0.906895 1.057752 2.674402
O  1.885429 -0.246964 -1.384579
O  0.672045 2.683046 0.091591
N  -0.179259 0.704914 -0.621447
C  -1.200739 -0.289813 -0.543477
C  -0.985176 -1.455546 0.205344
C  -2.390304 -0.088133 -1.255086
C  0.307484 -1.703924 0.940542
C  -2.648579 1.13216 -2.101529
C  0.810141 0.574515 -1.682773
C  -1.998873 -2.408084 0.230985
C  -3.377917 -1.064671 -1.192179
C  3.991094 -0.690895 -0.379151
C  2.867332 0.31419 -0.537558
C  -3.184302 -2.217701 -0.456417
C  -0.171915 1.819415 0.171553
C  5.16164 -0.153314 0.439597
C  0.178721 -2.54209 2.205283
C  -2.506538 0.845607 -3.595788
C  -1.301713 1.9565 1.182869
C  4.815329 0.184136 1.884875
H  0.763208 -0.751862 1.20481
H  1.009391 -2.183272 0.253691
H  -1.985416 1.954447 -1.832449
H  -3.663639 1.48669 -1.905253
H  1.134573 1.581337 -1.963182
H  0.309477 0.113905 -2.534146
H  -1.865078 -3.315903 0.803068
H  -4.308496 -0.912938 -1.726502
H  4.345626 -0.983287 -1.37095
H  3.600256 -1.598771 0.091678
H  2.443082 0.567806 0.439922
H  3.252064 1.250551 -0.966215
H  -3.960124 -2.971023 -0.413822
H  5.960478 -0.89853 0.429465
H  5.575566 0.732017 -0.052579
H  -0.105209 -3.57463 2.001453
H  -0.557679 -2.117874 2.887821
H  1.135357 -2.575272 2.726311
H  -3.191195 0.060125 -3.91533
H  -1.497561 0.518251 -3.845637
H  -2.721907 1.737455 -4.184367
H  -1.385105 3.007063 1.448072
H  -2.260423 1.589834 0.824968
H  4.370406 -0.672692 2.394437
H  4.110198 1.01231 1.95974
H  5.706201 0.470807 2.443748
totalener: -1328.97584495 hartree
nucrepener: 1985.18141516 hartree
electener: -3314.15726011 hartree
oneelecener: -5761.44932290 hartree
twoeener: 2447.29206279 hartree
kineticenergy: 1324.30308910 hartree
xcener: -107.427485287302 hartree
chargesum: -0.0000000
charge: -0.123059 -0.315542 -0.369846 0.012653 0.052058 -0.086937 -0.152301 -0.181046 -0.209686 0.093676 -0.061802 -0.039123 -0.092413 -0.009803 -0.160961 0.216129 -0.111488 -0.245664 -0.230436 -0.074277 -0.258853 0.066339 0.091289 0.086513 0.092640 0.109112 0.100276 0.117118 0.114426 0.072891 0.059232 0.080251 0.091314 0.124819 0.069257 0.054255 0.077411 0.089253 0.087070 0.081188 0.078341 0.090424 0.145659 0.126733 0.073722 0.082063 0.087126
qa: -0.1231 -0.3155 -0.3698 0.0127 0.0521 -0.0869 -0.1523 -0.1810 -0.2097 0.0937 -0.0618 -0.0391 -0.0924 -0.0098 -0.1610 0.2161 -0.1115 -0.2457 -0.2304 -0.0743 -0.2589 0.0663 0.0913 0.0865 0.0926 0.1091 0.1003 0.1171 0.1144 0.0729 0.0592 0.0803 0.0913 0.1248 0.0693 0.0543 0.0774 0.0893 0.0871 0.0812 0.0783 0.0904 0.1457 0.1267 0.0737 0.0821 0.0871
va: 1.1526 1.9942 2.1261 2.8527 3.7928 3.8554 3.7954 3.9237 3.9009 3.9685 3.8561 3.8613 3.8663 3.9099 4.0588 4.1784 3.9054 3.9204 3.9247 3.9580 3.9325 1.0168 1.0096 1.0128 0.9979 1.0094 1.0012 1.0066 1.0039 1.0210 1.0158 0.9804 1.0041 1.0027 1.0074 1.0098 1.0030 1.0117 1.0075 1.0063 1.0082 1.0076 1.0074 1.0080 1.0033 1.0018 1.0060
dispcorr: -0.027447999 hartree
energy: -1329.003292944061
dipole: 16.24600 -17.00099 -0.75499 -8.21615 7.75880 -0.45736 -8.61555 8.04281 -0.57274
magnitude: 1.05224 au
magnitude: 2.67458 debye
