program: Orca
programVersion: 5.0.2
elementType: Cl O O N C C C C C C C C C C C C C C C C C H H H H H H H H H H H H H H H H H H H H H H H H H H
charge: 0
multiplicity: 1
keywords: wb97x-d3
keywords: def2-TZVPP
keywords: def2/J RIJCOSX
keywords: DEFGRID2
keywords: scfconv7
keywords: smallprint printgap noloewdin
keywords: NOSOSCF
formula: C17H26ClNO2
InChI: InChI=1/C17H26ClNO2/c1-4-7-11-21-13-19(16(20)12-18)17-14(5-2)9-8-10-15(17)6-3/h8-10H,4-7,11-13H2,1-3H3
47 atoms
Cl -1.829355 2.672767 0.773368
O  2.154719 -0.119392 -0.373031
O  0.62823 1.229205 2.477931
N  0.080025 -0.204007 0.806734
C  -0.936829 -0.860146 0.050209
C  -1.529668 -2.00695 0.599149
C  -1.314456 -0.379271 -1.206959
C  -1.134347 -2.568841 1.941684
C  -0.653068 0.784784 -1.89387
C  1.444945 -0.691333 0.671905
C  -2.542131 -2.638631 -0.110755
C  -2.344209 -1.036998 -1.87667
C  3.490479 1.647312 -1.304227
C  2.650082 1.183056 -0.131729
C  -2.959283 -2.149923 -1.33716
C  -0.205695 0.752214 1.742885
C  4.797361 0.892465 -1.544914
C  -2.087953 -2.16988 3.066288
C  0.195071 0.33843 -3.082839
C  -1.647495 1.235283 1.817808
C  4.653688 -0.486095 -2.177943
H  -0.120377 -2.275883 2.213702
H  -1.119446 -3.65839 1.865569
H  -0.038328 1.352548 -1.20022
H  -1.429059 1.473277 -2.236243
H  1.390631 -1.758089 0.453458
H  1.953428 -0.548783 1.630287
H  -3.008863 -3.523774 0.305212
H  -2.664084 -0.662794 -2.841956
H  3.724916 2.69819 -1.11101
H  2.881564 1.640393 -2.213837
H  3.248038 1.195842 0.790021
H  1.826692 1.891273 0.019061
H  -3.757892 -2.643276 -1.875379
H  5.423387 1.508093 -2.196362
H  5.346344 0.811509 -0.601416
H  -2.078579 -1.095207 3.246021
H  -1.806906 -2.65528 4.000672
H  -3.114103 -2.455505 2.835812
H  1.00822 -0.307342 -2.757544
H  0.631614 1.20209 -3.586062
H  -0.396573 -0.206452 -3.819341
H  -2.388447 0.508106 1.499021
H  -1.849697 1.54579 2.840098
H  4.14852 -1.190038 -1.521794
H  5.631843 -0.900084 -2.424006
H  4.079291 -0.432843 -3.104423
totalener: -1328.97545242 hartree
nucrepener: 1991.51909819 hartree
electener: -3320.49455061 hartree
oneelecener: -5774.09762040 hartree
twoeener: 2453.60306980 hartree
kineticenergy: 1324.31390168 hartree
xcener: -107.426882060576 hartree
chargesum: 0.0000000
charge: -0.122120 -0.327697 -0.366780 0.011452 0.044154 -0.099284 -0.111108 -0.193306 -0.162504 0.083634 -0.038173 -0.060109 -0.129092 -0.013680 -0.161641 0.242645 -0.081783 -0.247893 -0.275447 -0.117984 -0.246367 0.085463 0.091265 0.055286 0.097306 0.100168 0.116943 0.114418 0.115102 0.080949 0.062995 0.089837 0.093561 0.125758 0.065842 0.044322 0.077532 0.094724 0.085666 0.090380 0.086251 0.084067 0.133910 0.151170 0.079795 0.084707 0.065665
qa: -0.1221 -0.3277 -0.3668 0.0115 0.0442 -0.0993 -0.1111 -0.1933 -0.1625 0.0836 -0.0382 -0.0601 -0.1291 -0.0137 -0.1616 0.2426 -0.0818 -0.2479 -0.2754 -0.1180 -0.2464 0.0855 0.0913 0.0553 0.0973 0.1002 0.1169 0.1144 0.1151 0.0809 0.0630 0.0898 0.0936 0.1258 0.0658 0.0443 0.0775 0.0947 0.0857 0.0904 0.0863 0.0841 0.1339 0.1512 0.0798 0.0847 0.0657
va: 1.1524 1.9677 2.1324 2.8719 3.7817 3.8741 3.8657 3.9272 3.8688 3.9476 3.8562 3.8748 3.9233 3.9020 4.0398 4.1333 3.8844 3.9176 3.9233 3.9788 3.9307 1.0048 1.0000 1.0405 1.0043 0.9951 1.0076 1.0051 1.0041 1.0124 1.0122 1.0057 0.9916 1.0019 1.0050 1.0114 1.0080 1.0089 1.0036 1.0150 1.0034 1.0145 1.0026 1.0007 1.0188 1.0052 1.0047
dispcorr: -0.028522542 hartree
energy: -1329.003974961141
dipole: 19.16027 -19.73347 -0.57320 -11.76781 10.74926 -1.01855 -10.56885 10.33859 -0.23026
magnitude: 1.19123 au
magnitude: 3.02786 debye
