program: Orca
programVersion: 5.0.2
elementType: Cl O O N C C C C C C C C C C C C C C C C C H H H H H H H H H H H H H H H H H H H H H H H H H H
charge: 0
multiplicity: 1
keywords: wb97x-d3
keywords: def2-TZVPP
keywords: def2/J RIJCOSX
keywords: DEFGRID2
keywords: scfconv7
keywords: smallprint printgap noloewdin
keywords: NOSOSCF
formula: C17H26ClNO2
InChI: InChI=1/C17H26ClNO2/c1-4-7-11-21-13-19(16(20)12-18)17-14(5-2)9-8-10-15(17)6-3/h8-10H,4-7,11-13H2,1-3H3
47 atoms
Cl -0.661763 2.748469 0.760518
O  1.921257 -1.050214 -1.108785
O  1.497501 0.548514 1.817918
N  0.143658 -0.642943 0.44774
C  -1.171373 -0.962649 -0.006645
C  -1.909078 -1.910824 0.717096
C  -1.687935 -0.372336 -1.16431
C  -1.38262 -2.575953 1.963087
C  -0.909981 0.583117 -2.02688
C  1.242012 -1.498783 0.01058
C  -3.189015 -2.231796 0.283972
C  -2.980764 -0.714699 -1.554105
C  2.78336 1.231672 -1.306582
C  3.050624 -0.212317 -0.916618
C  -3.729554 -1.629959 -0.839549
C  0.39866 0.349581 1.349118
C  4.037507 2.100116 -1.240152
C  -1.857889 -1.898133 3.246541
C  -0.47141 -0.056931 -3.341565
C  -0.760754 1.255355 1.736746
C  4.619891 2.235744 0.161857
H  -0.292847 -2.617428 1.96136
H  -1.721072 -3.614767 1.968511
H  -0.0354 0.956445 -1.50227
H  -1.534829 1.455022 -2.233866
H  0.796071 -2.457533 -0.256863
H  1.917356 -1.649636 0.85868
H  -3.767007 -2.963656 0.836136
H  -3.400776 -0.252044 -2.439459
H  2.019073 1.664654 -0.655691
H  2.381058 1.251077 -2.323981
H  3.849512 -0.610421 -1.551683
H  3.39742 -0.273183 0.118977
H  -4.730948 -1.8831 -1.162301
H  4.798381 1.704586 -1.920419
H  3.787127 3.092991 -1.62015
H  -2.946107 -1.85244 3.289512
H  -1.483278 -0.878376 3.331176
H  -1.510337 -2.443187 4.124104
H  0.194725 -0.898364 -3.160288
H  0.0661 0.666522 -3.955774
H  -1.322387 -0.415503 -3.921905
H  -1.747057 0.827516 1.581886
H  -0.640478 1.539006 2.779865
H  5.420449 2.975416 0.184327
H  5.03941 1.297951 0.526867
H  3.855735 2.546254 0.875774
totalener: -1328.97427445 hartree
nucrepener: 2005.78553646 hartree
electener: -3334.75981091 hartree
oneelecener: -5802.79956454 hartree
twoeener: 2468.03975363 hartree
kineticenergy: 1324.30132669 hartree
xcener: -107.426144549959 hartree
chargesum: 0.0000000
charge: -0.117789 -0.330564 -0.374215 0.052036 0.007611 -0.079910 -0.118446 -0.189010 -0.136908 0.050203 -0.038203 -0.052466 -0.111921 0.023127 -0.158922 0.226025 -0.110871 -0.248944 -0.257284 -0.112446 -0.247731 0.086220 0.087914 0.026513 0.093919 0.110371 0.116257 0.114191 0.115449 0.054804 0.070469 0.090201 0.079965 0.125857 0.052976 0.067443 0.086632 0.076747 0.094680 0.093604 0.082470 0.077784 0.134187 0.148913 0.082416 0.067081 0.089566
qa: -0.1178 -0.3306 -0.3742 0.0520 0.0076 -0.0799 -0.1184 -0.1890 -0.1369 0.0502 -0.0382 -0.0525 -0.1119 0.0231 -0.1589 0.2260 -0.1109 -0.2489 -0.2573 -0.1124 -0.2477 0.0862 0.0879 0.0265 0.0939 0.1104 0.1163 0.1142 0.1154 0.0548 0.0705 0.0902 0.0800 0.1259 0.0530 0.0674 0.0866 0.0767 0.0947 0.0936 0.0825 0.0778 0.1342 0.1489 0.0824 0.0671 0.0896
va: 1.1570 2.0003 2.1166 2.8304 3.7827 3.8732 3.9143 3.9280 3.8745 3.9858 3.8560 3.8633 3.8806 3.8878 4.0320 4.1357 3.9308 3.9164 3.9184 3.9743 3.9343 1.0042 1.0016 1.0504 1.0075 0.9916 0.9974 1.0058 1.0035 1.0208 1.0147 0.9957 1.0087 1.0016 1.0102 1.0067 1.0032 1.0086 1.0090 1.0200 1.0057 1.0116 1.0023 1.0012 1.0052 1.0029 1.0072
dispcorr: -0.029107222 hartree
energy: -1329.003381676107
dipole: 12.66167 -13.54008 -0.87840 -6.48879 5.63778 -0.85101 -5.39025 5.44397 0.05373
magnitude: 1.22421 au
magnitude: 3.11169 debye
