program: Orca
programVersion: 5.0.2
elementType: Cl O O N C C C C C C C C C C C C C C C C C H H H H H H H H H H H H H H H H H H H H H H H H H H
charge: 0
multiplicity: 1
keywords: wb97x-d3
keywords: def2-TZVPP
keywords: def2/J RIJCOSX
keywords: DEFGRID2
keywords: scfconv7
keywords: smallprint printgap noloewdin
keywords: NOSOSCF
formula: C17H26ClNO2
InChI: InChI=1/C17H26ClNO2/c1-4-7-11-21-13-19(16(20)12-18)17-14(5-2)9-8-10-15(17)6-3/h8-10H,4-7,11-13H2,1-3H3
47 atoms
Cl -1.07388 0.840707 2.773991
O  2.022346 0.354301 -1.084411
O  0.222816 2.916046 0.345094
N  -0.246683 0.852267 -0.47332
C  -1.151055 -0.251262 -0.540652
C  -0.842173 -1.452551 0.112142
C  -2.327208 -0.107696 -1.288545
C  0.450463 -1.634747 0.864412
C  -2.668818 1.145681 -2.053038
C  0.820169 0.929366 -1.463794
C  -1.756137 -2.497455 0.017265
C  -3.213044 -1.17731 -1.349742
C  4.171255 0.463068 -0.058624
C  2.794749 1.087441 -0.154347
C  -2.931864 -2.363892 -0.699796
C  -0.456694 1.914783 0.362932
C  4.175206 -0.964998 0.473597
C  0.388457 -2.606997 2.033183
C  -2.323127 1.033816 -3.537632
C  -1.600989 1.795979 1.359767
C  5.582389 -1.525089 0.62242
H  0.793566 -0.670843 1.234084
H  1.216812 -1.962845 0.158063
H  -2.17142 2.022783 -1.638427
H  -3.740527 1.334426 -1.954242
H  0.948798 1.981133 -1.740251
H  0.484429 0.372303 -2.337657
H  -1.551287 -3.433979 0.517662
H  -4.13305 -1.072189 -1.91271
H  4.773142 1.097397 0.599883
H  4.655065 0.496012 -1.03978
H  2.320921 1.089084 0.835591
H  2.875289 2.135453 -0.468011
H  -3.630257 -3.189079 -0.750279
H  3.665365 -0.990676 1.442303
H  3.59526 -1.606606 -0.193092
H  0.219761 -3.637115 1.718778
H  -0.400254 -2.333956 2.734413
H  1.334571 -2.593687 2.574048
H  -2.612598 1.938358 -4.072557
H  -2.837749 0.19107 -3.999329
H  -1.25445 0.886878 -3.690657
H  -1.844634 2.794871 1.711483
H  -2.491345 1.319334 0.957733
H  5.567938 -2.54784 0.99938
H  6.178059 -0.927684 1.314795
H  6.106449 -1.535718 -0.33468
totalener: -1328.97686676 hartree
nucrepener: 1986.81544716 hartree
electener: -3315.79231392 hartree
oneelecener: -5764.72638568 hartree
twoeener: 2448.93407177 hartree
kineticenergy: 1324.30753971 hartree
xcener: -107.427572812002 hartree
chargesum: 0.0000000
charge: -0.123325 -0.311966 -0.368374 0.026591 0.051819 -0.067436 -0.168813 -0.208590 -0.190851 0.077964 -0.060010 -0.037832 -0.104919 -0.012699 -0.158208 0.212650 -0.074394 -0.244872 -0.237435 -0.073574 -0.261438 0.064210 0.100828 0.085426 0.088722 0.113270 0.100789 0.117433 0.113750 0.058200 0.059738 0.079429 0.100895 0.125332 0.047525 0.064780 0.077230 0.090182 0.087569 0.091640 0.083143 0.079174 0.145163 0.129722 0.083389 0.073245 0.074931
qa: -0.1233 -0.3120 -0.3684 0.0266 0.0518 -0.0674 -0.1688 -0.2086 -0.1909 0.0780 -0.0600 -0.0378 -0.1049 -0.0127 -0.1582 0.2126 -0.0744 -0.2449 -0.2374 -0.0736 -0.2614 0.0642 0.1008 0.0854 0.0887 0.1133 0.1008 0.1174 0.1137 0.0582 0.0597 0.0794 0.1009 0.1253 0.0475 0.0648 0.0772 0.0902 0.0876 0.0916 0.0831 0.0792 0.1452 0.1297 0.0834 0.0732 0.0749
va: 1.1530 1.9895 2.1250 2.8377 3.7782 3.8447 3.8248 3.9341 3.9024 3.9740 3.8522 3.8600 3.9178 3.9192 4.0588 4.1764 3.8513 3.9238 3.9204 3.9510 3.9629 1.0208 0.9998 1.0115 0.9993 1.0044 0.9998 1.0065 1.0044 1.0131 1.0195 0.9886 1.0083 1.0024 1.0076 1.0169 1.0029 1.0111 1.0073 1.0075 1.0053 1.0087 1.0082 1.0068 1.0056 1.0024 1.0024
dispcorr: -0.027818553 hartree
energy: -1329.004685309215
dipole: 18.28086 -19.02310 -0.74224 -10.15206 9.62484 -0.52722 -11.27072 10.62305 -0.64766
magnitude: 1.11730 au
magnitude: 2.83995 debye
