program: Orca
programVersion: 5.0.2
elementType: Cl O O N C C C C C C C C C C C C C C C C C H H H H H H H H H H H H H H H H H H H H H H H H H H
charge: 0
multiplicity: 1
keywords: wb97x-d3
keywords: def2-TZVPP
keywords: def2/J RIJCOSX
keywords: DEFGRID2
keywords: scfconv7
keywords: smallprint printgap noloewdin
keywords: NOSOSCF
formula: C17H26ClNO2
InChI: InChI=1/C17H26ClNO2/c1-4-7-11-21-13-19(16(20)12-18)17-14(5-2)9-8-10-15(17)6-3/h8-10H,4-7,11-13H2,1-3H3
47 atoms
Cl -2.658955 1.274325 2.279983
O  2.304682 -0.257643 -0.090115
O  0.678067 2.001584 1.858638
N  0.073663 0.152895 0.692757
C  -0.913295 -0.556413 -0.054125
C  -1.62562 -1.58574 0.580742
C  -1.136754 -0.235388 -1.396096
C  -1.357096 -1.958254 2.018013
C  -0.362842 0.825803 -2.131992
C  1.362751 -0.491805 0.900647
C  -2.575206 -2.278515 -0.159396
C  -2.111338 -0.943875 -2.09274
C  4.351365 0.827344 -0.70814
C  3.017793 0.96244 -0.001721
C  -2.823094 -1.958156 -1.483361
C  -0.158864 1.383291 1.240554
C  4.261668 0.558094 -2.204706
C  -2.567659 -2.473181 2.786216
C  0.600765 0.222746 -3.152083
C  -1.552352 1.967848 1.061279
C  5.630738 0.532917 -2.869666
H  -0.952823 -1.097955 2.550285
H  -0.569109 -2.719327 2.043601
H  0.202539 1.453364 -1.444007
H  -1.066224 1.488631 -2.643892
H  1.18595 -1.566926 0.901239
H  1.73475 -0.195759 1.886383
H  -3.142106 -3.074372 0.304233
H  -2.306534 -0.69448 -3.129051
H  4.937957 0.040221 -0.224379
H  4.899608 1.760526 -0.542314
H  3.183441 1.230388 1.047399
H  2.440072 1.782033 -0.448583
H  -3.576076 -2.502119 -2.0384
H  3.753867 -0.392642 -2.377846
H  3.639659 1.326137 -2.675101
H  -2.314794 -2.604154 3.837757
H  -2.918754 -3.438077 2.42115
H  -3.395903 -1.767874 2.726381
H  1.322629 -0.423297 -2.656266
H  1.150068 1.004547 -3.677109
H  0.072066 -0.371856 -3.897439
H  -1.494633 3.037625 1.242692
H  -1.986241 1.78349 0.082186
H  6.14706 1.487539 -2.754793
H  5.553828 0.32724 -3.937322
H  6.268169 -0.237585 -2.43282
totalener: -1328.97720327 hartree
nucrepener: 1969.36262963 hartree
electener: -3298.33983289 hartree
oneelecener: -5729.79695688 hartree
twoeener: 2431.45712399 hartree
kineticenergy: 1324.30610792 hartree
xcener: -107.427151237764 hartree
chargesum: 0.0000000
charge: -0.125369 -0.320339 -0.371150 0.017556 0.110672 -0.092111 -0.193040 -0.205574 -0.179927 0.087494 -0.047840 -0.048463 -0.100034 -0.007024 -0.166501 0.216431 -0.075496 -0.252542 -0.266246 -0.065575 -0.261713 0.098927 0.086591 0.067613 0.096975 0.096971 0.112411 0.116280 0.114305 0.058278 0.056948 0.100090 0.073306 0.125026 0.067015 0.045035 0.090248 0.076698 0.091564 0.092974 0.085995 0.089453 0.143981 0.127379 0.072670 0.084434 0.075627
qa: -0.1254 -0.3203 -0.3712 0.0176 0.1107 -0.0921 -0.1930 -0.2056 -0.1799 0.0875 -0.0478 -0.0485 -0.1000 -0.0070 -0.1665 0.2164 -0.0755 -0.2525 -0.2662 -0.0656 -0.2617 0.0989 0.0866 0.0676 0.0970 0.0970 0.1124 0.1163 0.1143 0.0583 0.0569 0.1001 0.0733 0.1250 0.0670 0.0450 0.0902 0.0767 0.0916 0.0930 0.0860 0.0895 0.1440 0.1274 0.0727 0.0844 0.0756
va: 1.1523 1.9860 2.1250 2.8830 3.7206 3.7869 3.8167 3.8936 3.8858 3.9986 3.8627 3.8639 3.9285 3.9043 4.0660 4.1905 3.8546 3.9407 3.9191 3.9632 3.9636 1.0073 0.9978 1.0267 0.9979 0.9999 1.0022 1.0051 1.0036 1.0205 1.0128 1.0110 0.9895 1.0027 1.0124 1.0073 1.0070 1.0010 1.0117 1.0140 1.0063 1.0116 1.0092 1.0090 1.0027 1.0054 1.0025
dispcorr: -0.027351934 hartree
energy: -1329.004555199154
dipole: 24.82991 -25.06470 -0.23478 -6.39708 5.91354 -0.48354 -18.68555 17.89292 -0.79262
magnitude: 0.95770 au
magnitude: 2.43427 debye
