program: Orca
programVersion: 5.0.2
elementType: Cl O O N C C C C C C C C C C C C C C C C C H H H H H H H H H H H H H H H H H H H H H H H H H H
charge: 0
multiplicity: 1
keywords: wb97x-d3
keywords: def2-TZVPP
keywords: def2/J RIJCOSX
keywords: DEFGRID2
keywords: scfconv7
keywords: smallprint printgap noloewdin
keywords: NOSOSCF
formula: C17H26ClNO2
InChI: InChI=1/C17H26ClNO2/c1-4-7-11-21-13-19(16(20)12-18)17-14(5-2)9-8-10-15(17)6-3/h8-10H,4-7,11-13H2,1-3H3
47 atoms
Cl -3.33298 2.07875 2.295255
O  2.214954 0.356948 0.757636
O  -0.529197 2.631316 1.870583
N  -0.000307 0.930627 0.459879
C  -0.388631 -0.261034 -0.218831
C  -0.318889 -1.494446 0.443568
C  -0.78257 -0.176666 -1.560269
C  0.095429 -1.632027 1.88712
C  -0.886355 1.131152 -2.30178
C  1.364308 1.355256 0.276629
C  -0.634276 -2.642787 -0.275855
C  -1.0921 -1.350401 -2.237998
C  3.579117 -0.183361 -1.223374
C  3.509713 0.356591 0.200441
C  -1.012262 -2.576969 -1.604881
C  -0.85121 1.63998 1.268732
C  3.02437 -1.592728 -1.386391
C  -0.928214 -2.366452 2.749673
C  0.168103 1.279376 -3.397269
C  -2.266645 1.071224 1.314059
C  3.101305 -2.08568 -2.823594
H  0.304345 -0.659126 2.325253
H  1.046438 -2.169306 1.919966
H  -0.81909 1.975393 -1.615413
H  -1.878251 1.195131 -2.757199
H  1.504494 2.298512 0.810382
H  1.536238 1.536335 -0.791631
H  -0.571545 -3.608105 0.211038
H  -1.405041 -1.298697 -3.274196
H  4.631356 -0.161208 -1.526194
H  3.067753 0.491136 -1.918521
H  4.108321 -0.278457 0.857324
H  3.956792 1.359805 0.240349
H  -1.250387 -3.483375 -2.145924
H  3.57368 -2.275963 -0.731038
H  1.986283 -1.622939 -1.052966
H  -1.104427 -3.386481 2.409298
H  -1.892796 -1.857294 2.757845
H  -0.581722 -2.424005 3.781326
H  0.085208 0.489031 -4.143454
H  1.178284 1.232986 -2.989443
H  0.061015 2.234174 -3.911904
H  -2.684128 0.99833 0.309567
H  -2.265004 0.06524 1.731341
H  2.523647 -1.441571 -3.489098
H  2.698655 -3.094082 -2.918341
H  4.12867 -2.103249 -3.191449
totalener: -1328.97172330 hartree
nucrepener: 1998.54496795 hartree
electener: -3327.51669125 hartree
oneelecener: -5787.85609059 hartree
twoeener: 2460.33939934 hartree
kineticenergy: 1324.31655065 hartree
xcener: -107.433358287974 hartree
chargesum: -0.0000000
charge: -0.104251 -0.307683 -0.351957 -0.048228 0.164796 -0.153021 -0.146991 -0.196097 -0.216001 0.030237 -0.010670 -0.033930 -0.137722 -0.002904 -0.184462 0.236236 -0.038364 -0.225457 -0.235594 -0.079247 -0.260949 0.092333 0.088448 0.090144 0.095992 0.118767 0.104753 0.113988 0.113018 0.078919 0.059939 0.083912 0.084083 0.125791 0.060633 0.021177 0.073969 0.079098 0.092740 0.081199 0.066500 0.099289 0.122310 0.120228 0.068200 0.086027 0.080803
qa: -0.1043 -0.3077 -0.3520 -0.0482 0.1648 -0.1530 -0.1470 -0.1961 -0.2160 0.0302 -0.0107 -0.0339 -0.1377 -0.0029 -0.1845 0.2362 -0.0384 -0.2255 -0.2356 -0.0792 -0.2609 0.0923 0.0884 0.0901 0.0960 0.1188 0.1048 0.1140 0.1130 0.0789 0.0599 0.0839 0.0841 0.1258 0.0606 0.0212 0.0740 0.0791 0.0927 0.0812 0.0665 0.0993 0.1223 0.1202 0.0682 0.0860 0.0808
va: 1.1715 1.9621 2.1609 2.9638 3.5141 3.7836 3.7668 3.9099 3.8908 3.9496 3.7896 3.8282 3.8578 3.9539 4.0447 4.1507 3.8548 3.9150 3.9310 4.0374 3.9497 1.0207 1.0041 1.0137 0.9978 1.0365 0.9701 1.0043 1.0042 1.0212 1.0074 0.9968 0.9965 1.0030 1.0140 1.0298 1.0066 1.0037 1.0072 1.0060 1.0042 1.0115 1.0109 1.0090 1.0031 1.0070 1.0055
dispcorr: -0.029076671 hartree
energy: -1329.000799969783
dipole: 25.14363 -24.38418 0.75945 -18.03436 16.68818 -1.34618 -21.24490 19.71990 -1.52500
magnitude: 2.17131 au
magnitude: 5.51904 debye
