program: Orca
programVersion: 5.0.2
elementType: Cl O O N C C C C C C C C C C C C C C C C C H H H H H H H H H H H H H H H H H H H H H H H H H H
charge: 0
multiplicity: 1
keywords: wb97x-d3
keywords: def2-TZVPP
keywords: def2/J RIJCOSX
keywords: DEFGRID2
keywords: scfconv7
keywords: smallprint printgap noloewdin
keywords: NOSOSCF
formula: C17H26ClNO2
InChI: InChI=1/C17H26ClNO2/c1-4-7-11-21-13-19(16(20)12-18)17-14(5-2)9-8-10-15(17)6-3/h8-10H,4-7,11-13H2,1-3H3
47 atoms
Cl -3.140652 1.859613 0.554287
O  2.314243 0.485821 0.543061
O  -0.265711 2.372935 2.322927
N  0.055507 0.9664 0.565857
C  -0.33785 -0.20428 -0.147749
C  -0.183006 -1.45917 0.455172
C  -0.801802 -0.075718 -1.46406
C  0.333167 -1.651834 1.860251
C  -0.925974 1.268853 -2.136981
C  1.370729 1.475344 0.269087
C  -0.51516 -2.589167 -0.284563
C  -1.115382 -1.234557 -2.165569
C  4.249294 -0.727458 -0.154412
C  3.510744 0.596527 -0.185527
C  -0.975219 -2.481625 -1.583425
C  -0.676149 1.50488 1.589683
C  3.445098 -1.918974 -0.673757
C  -0.68197 -2.293588 2.8041
C  -2.157974 1.423769 -3.021218
C  -2.104361 1.000467 1.730364
C  2.846164 -1.722787 -2.059435
H  0.686716 -0.715555 2.285213
H  1.217946 -2.292123 1.809422
H  -0.028143 1.443752 -2.740296
H  -0.941383 2.056258 -1.384679
H  1.531867 2.379438 0.860841
H  1.412353 1.748566 -0.795309
H  -0.393853 -3.569041 0.161895
H  -1.472502 -1.164714 -3.184381
H  4.587156 -0.93338 0.864769
H  5.155319 -0.603524 -0.7558
H  4.151179 1.389742 0.225272
H  3.297686 0.876827 -1.227937
H  -1.22015 -3.372071 -2.147633
H  4.103216 -2.791626 -0.682498
H  2.643924 -2.153767 0.028137
H  -1.572766 -1.677345 2.929065
H  -0.244999 -2.435981 3.792505
H  -1.012154 -3.269389 2.447504
H  -2.136564 0.768738 -3.891808
H  -2.225831 2.445682 -3.393548
H  -3.067289 1.210145 -2.46085
H  -2.224044 -0.06312 1.547254
H  -2.458885 1.247905 2.727278
H  2.394206 -2.646238 -2.420605
H  3.601689 -1.419034 -2.787344
H  2.056748 -0.970223 -2.05619
totalener: -1328.97217050 hartree
nucrepener: 2027.40569392 hartree
electener: -3356.37786441 hartree
oneelecener: -5845.79770302 hartree
twoeener: 2489.41983860 hartree
kineticenergy: 1324.30912674 hartree
xcener: -107.431267834117 hartree
chargesum: -0.0000000
charge: -0.128080 -0.304566 -0.365556 -0.020706 0.193225 -0.263678 -0.121424 -0.169916 -0.230521 0.058965 0.003824 -0.001086 -0.130824 -0.006940 -0.202893 0.260843 -0.076531 -0.227115 -0.243732 -0.100953 -0.279213 0.090858 0.088208 0.085866 0.097372 0.111755 0.097803 0.113216 0.114057 0.074390 0.064995 0.091961 0.067074 0.123691 0.074495 0.048589 0.070227 0.093658 0.075668 0.076547 0.088776 0.086209 0.123375 0.149400 0.089655 0.090539 0.068491
qa: -0.1281 -0.3046 -0.3656 -0.0207 0.1932 -0.2637 -0.1214 -0.1699 -0.2305 0.0590 0.0038 -0.0011 -0.1308 -0.0069 -0.2029 0.2608 -0.0765 -0.2271 -0.2437 -0.1010 -0.2792 0.0909 0.0882 0.0859 0.0974 0.1118 0.0978 0.1132 0.1141 0.0744 0.0650 0.0920 0.0671 0.1237 0.0745 0.0486 0.0702 0.0937 0.0757 0.0765 0.0888 0.0862 0.1234 0.1494 0.0897 0.0905 0.0685
va: 1.1527 1.9794 2.1442 2.9477 3.5509 3.8344 3.7175 3.8951 3.8789 3.9286 3.7853 3.7911 3.9246 3.9247 4.0588 4.1364 3.8604 3.9219 3.9304 3.9720 3.9426 1.0272 1.0006 0.9974 1.0135 1.0294 0.9825 1.0034 1.0047 1.0141 1.0144 0.9966 0.9890 1.0036 1.0109 1.0262 1.0115 1.0066 1.0073 1.0038 1.0067 1.0179 1.0162 1.0045 1.0086 1.0067 0.9951
dispcorr: -0.029916402 hartree
energy: -1329.002086898589
dipole: 20.71698 -20.23234 0.48464 -16.16537 15.09202 -1.07336 -10.39039 9.54272 -0.84768
magnitude: 1.45104 au
magnitude: 3.68826 debye
