program: Orca
programVersion: 5.0.2
elementType: Cl O O N C C C C C C C C C C C C C C C C C H H H H H H H H H H H H H H H H H H H H H H H H H H
charge: 0
multiplicity: 1
keywords: wb97x-d3
keywords: def2-TZVPP
keywords: def2/J RIJCOSX
keywords: DEFGRID2
keywords: scfconv7
keywords: smallprint printgap noloewdin
keywords: NOSOSCF
formula: C17H26ClNO2
InChI: InChI=1/C17H26ClNO2/c1-4-7-11-21-13-19(16(20)12-18)17-14(5-2)9-8-10-15(17)6-3/h8-10H,4-7,11-13H2,1-3H3
47 atoms
Cl -3.275611 1.919896 0.811957
O  2.183849 0.678006 0.198091
O  -0.192976 2.578733 2.057171
N  -0.083623 1.044861 0.385363
C  -0.553728 -0.171117 -0.19639
C  -0.306954 -1.385751 0.465123
C  -1.189199 -0.124015 -1.440881
C  0.352097 -1.412814 1.823418
C  -1.451763 1.178251 -2.155164
C  1.156362 1.560582 -0.132078
C  -0.711441 -2.559393 -0.157532
C  -1.564022 -1.328406 -2.031012
C  4.203762 -0.429917 -0.363976
C  3.362451 0.816676 -0.553647
C  -1.326253 -2.532457 -1.398759
C  -0.677537 1.646392 1.461968
C  3.551678 -1.693122 -0.915189
C  0.878232 -2.769133 2.270182
C  -2.821973 1.263949 -2.819016
C  -2.054215 1.125928 1.847532
C  4.373661 -2.943378 -0.63999
H  -0.358173 -1.057132 2.579402
H  1.173556 -0.698444 1.835863
H  -0.675903 1.331888 -2.912945
H  -1.358191 2.007103 -1.454747
H  1.318902 2.558353 0.283153
H  1.073383 1.649356 -1.224468
H  -0.536636 -3.513013 0.321185
H  -2.050643 -1.32396 -2.997426
H  4.422448 -0.55402 0.701086
H  5.167973 -0.266791 -0.855144
H  3.923228 1.708617 -0.242027
H  3.12625 0.944404 -1.621614
H  -1.623111 -3.459079 -1.87259
H  2.553025 -1.809919 -0.488981
H  3.405311 -1.580573 -1.993962
H  1.589122 -3.179283 1.551192
H  0.085123 -3.502811 2.416289
H  1.39798 -2.666618 3.222139
H  -3.614878 1.067887 -2.098614
H  -2.934702 0.560673 -3.643686
H  -2.978824 2.26223 -3.226882
H  -2.182315 0.053283 1.731292
H  -2.254708 1.41401 2.875898
H  3.896768 -3.831892 -1.05409
H  4.496413 -3.106291 0.432267
H  5.371718 -2.873129 -1.076131
totalener: -1328.97514542 hartree
nucrepener: 1989.16309048 hartree
electener: -3318.13823590 hartree
oneelecener: -5769.32164148 hartree
twoeener: 2451.18340557 hartree
kineticenergy: 1324.30823638 hartree
xcener: -107.429507264512 hartree
chargesum: -0.0000000
charge: -0.127126 -0.307550 -0.364848 -0.041035 0.143794 -0.258443 -0.053469 -0.117171 -0.244605 0.077609 -0.034046 -0.043935 -0.111548 -0.002547 -0.168453 0.259524 -0.048082 -0.280345 -0.244004 -0.104516 -0.269353 0.077590 0.116859 0.089438 0.097831 0.108259 0.099394 0.120653 0.114358 0.064635 0.063525 0.087134 0.060297 0.124801 0.034031 0.054890 0.085480 0.078506 0.095131 0.085559 0.077202 0.088181 0.129398 0.147330 0.087188 0.073707 0.078772
qa: -0.1271 -0.3075 -0.3648 -0.0410 0.1438 -0.2584 -0.0535 -0.1172 -0.2446 0.0776 -0.0340 -0.0439 -0.1115 -0.0025 -0.1685 0.2595 -0.0481 -0.2803 -0.2440 -0.1045 -0.2694 0.0776 0.1169 0.0894 0.0978 0.1083 0.0994 0.1207 0.1144 0.0646 0.0635 0.0871 0.0603 0.1248 0.0340 0.0549 0.0855 0.0785 0.0951 0.0856 0.0772 0.0882 0.1294 0.1473 0.0872 0.0737 0.0788
va: 1.1513 1.9821 2.1464 2.9785 3.6979 3.8721 3.7305 3.8388 3.8886 3.9274 3.8027 3.8580 3.9061 3.9536 4.0872 4.1335 3.8690 3.9660 3.9277 3.9804 3.9474 0.9954 1.0214 0.9960 1.0118 1.0221 0.9801 1.0036 1.0054 1.0161 1.0160 0.9944 0.9951 1.0031 1.0212 1.0147 0.9987 0.9986 1.0066 1.0189 1.0042 1.0070 1.0078 1.0051 1.0046 1.0027 1.0042
dispcorr: -0.027239145 hartree
energy: -1329.002384565816
dipole: 25.48106 -25.04812 0.43294 -19.25388 18.20462 -1.04926 -9.47866 8.63405 -0.84461
magnitude: 1.41483 au
magnitude: 3.59620 debye
