program: Orca
programVersion: 5.0.2
elementType: Cl O O N C C C C C C C C C C C C C C C C C H H H H H H H H H H H H H H H H H H H H H H H H H H
charge: 0
multiplicity: 1
keywords: wb97x-d3
keywords: def2-TZVPP
keywords: def2/J RIJCOSX
keywords: DEFGRID2
keywords: scfconv7
keywords: smallprint printgap noloewdin
keywords: NOSOSCF
formula: C17H26ClNO2
InChI: InChI=1/C17H26ClNO2/c1-4-7-11-21-13-19(16(20)12-18)17-14(5-2)9-8-10-15(17)6-3/h8-10H,4-7,11-13H2,1-3H3
47 atoms
Cl -3.122832 2.041352 1.084739
O  2.193986 0.516631 -0.100609
O  0.102058 2.408783 1.81351
N  -0.077664 0.852629 0.170788
C  -0.671091 -0.346324 -0.324793
C  -0.360263 -1.573158 0.275208
C  -1.506691 -0.268408 -1.4480
C  0.520816 -1.710846 1.492134
C  -1.821629 1.046715 -2.117606
C  1.112607 1.306104 -0.492914
C  -0.90716 -2.728347 -0.274376
C  -2.024605 -1.450973 -1.963693
C  4.495883 -0.071065 -0.278935
C  3.399316 0.871956 -0.729227
C  -1.727612 -2.672249 -1.384935
C  -0.502051 1.497078 1.302266
C  4.272134 -1.522918 -0.684896
C  -0.241014 -2.18033 2.730915
C  -3.279625 1.207218 -2.533889
C  -1.846661 1.061162 1.864154
C  5.415191 -2.428682 -0.249266
H  1.045614 -0.784206 1.709942
H  1.303617 -2.439133 1.263654
H  -1.181123 1.155384 -2.999451
H  -1.561946 1.870705 -1.454769
H  1.273331 2.360487 -0.247212
H  0.955272 1.226032 -1.577591
H  -0.671435 -3.687801 0.170853
H  -2.667505 -1.420075 -2.833544
H  4.608033 0.001921 0.807018
H  5.43754 0.286817 -0.706804
H  3.672153 1.908179 -0.481704
H  3.294005 0.823795 -1.824666
H  -2.134195 -3.582877 -1.80509
H  3.332757 -1.882631 -0.259994
H  4.154167 -1.579457 -1.771497
H  -1.007583 -1.466311 3.032867
H  0.437851 -2.302829 3.574776
H  -0.737673 -3.13647 2.564949
H  -3.943203 1.069827 -1.681378
H  -3.575501 0.500934 -3.309109
H  -3.447818 2.207822 -2.931252
H  -2.093931 0.017689 1.694764
H  -1.865827 1.279476 2.928691
H  6.364204 -2.110235 -0.684211
H  5.245082 -3.461267 -0.554329
H  5.535008 -2.422337 0.835437
totalener: -1328.97549763 hartree
nucrepener: 1962.56007280 hartree
electener: -3291.53557043 hartree
oneelecener: -5716.13079068 hartree
twoeener: 2424.59522025 hartree
kineticenergy: 1324.30607674 hartree
xcener: -107.424727338689 hartree
chargesum: 0.0000000
charge: -0.125647 -0.304290 -0.364183 -0.048505 0.115089 -0.176897 -0.041265 -0.219500 -0.244909 0.116848 -0.036246 -0.041645 -0.118418 0.000580 -0.168654 0.276988 -0.065410 -0.227591 -0.239490 -0.122016 -0.257273 0.097218 0.084857 0.091392 0.094022 0.098606 0.098576 0.116030 0.114301 0.067170 0.058166 0.082504 0.061913 0.124269 0.057771 0.048545 0.070425 0.092873 0.077718 0.082833 0.076678 0.088610 0.127417 0.149268 0.072216 0.084301 0.074755
qa: -0.1256 -0.3043 -0.3642 -0.0485 0.1151 -0.1769 -0.0413 -0.2195 -0.2449 0.1168 -0.0362 -0.0416 -0.1184 0.0006 -0.1687 0.2770 -0.0654 -0.2276 -0.2395 -0.1220 -0.2573 0.0972 0.0849 0.0914 0.0940 0.0986 0.0986 0.1160 0.1143 0.0672 0.0582 0.0825 0.0619 0.1243 0.0578 0.0485 0.0704 0.0929 0.0777 0.0828 0.0767 0.0886 0.1274 0.1493 0.0722 0.0843 0.0748
va: 1.1535 1.9919 2.1472 2.9983 3.7154 3.8459 3.7477 3.9016 3.9006 3.9145 3.8530 3.8546 3.9410 3.9522 4.0592 4.1113 3.8714 3.9257 3.9293 3.9906 3.9492 1.0320 0.9999 0.9956 1.0151 1.0125 0.9830 1.0028 1.0065 1.0165 1.0144 0.9962 0.9911 1.0028 1.0140 1.0131 1.0110 1.0074 1.0063 1.0211 1.0048 1.0071 1.0100 1.0024 1.0032 1.0057 1.0029
dispcorr: -0.026034312 hartree
energy: -1329.001531938779
dipole: 24.73464 -24.43604 0.29860 -16.98234 15.88378 -1.09857 -7.84595 7.01027 -0.83568
magnitude: 1.41222 au
magnitude: 3.58958 debye
