program: Orca
programVersion: 5.0.2
elementType: Cl O O N C C C C C C C C C C C C C C C C C H H H H H H H H H H H H H H H H H H H H H H H H H H
charge: 0
multiplicity: 1
keywords: wb97x-d3
keywords: def2-TZVPP
keywords: def2/J RIJCOSX
keywords: DEFGRID2
keywords: scfconv7
keywords: smallprint printgap noloewdin
keywords: NOSOSCF
formula: C17H26ClNO2
InChI: InChI=1/C17H26ClNO2/c1-4-7-11-21-13-19(16(20)12-18)17-14(5-2)9-8-10-15(17)6-3/h8-10H,4-7,11-13H2,1-3H3
47 atoms
Cl -3.151126 0.996894 1.933906
O  2.183489 0.8563 0.096931
O  -0.436045 2.935713 1.448145
N  -0.022213 0.811452 0.753602
C  -0.400824 -0.315895 -0.035178
C  -0.725781 -1.515934 0.611694
C  -0.356534 -0.22625 -1.432675
C  -0.744703 -1.632713 2.115611
C  0.002024 1.033669 -2.181513
C  1.344119 0.823517 1.20913
C  -1.003929 -2.63052 -0.172067
C  -0.653352 -1.365485 -2.173937
C  4.108765 0.020013 -1.013648
C  3.501316 0.419827 0.316601
C  -0.968201 -2.55949 -1.553136
C  -0.820855 1.906346 0.946495
C  3.436294 -1.194003 -1.645219
C  -1.919252 -2.432212 2.668662
C  -1.159849 1.607834 -2.991041
C  -2.283798 1.745366 0.561486
C  3.989097 -1.514183 -3.025818
H  -0.764268 -0.640199 2.563306
H  0.191576 -2.096289 2.444911
H  0.8235 0.796506 -2.863015
H  0.396701 1.795648 -1.514056
H  1.529028 -0.089197 1.794243
H  1.484451 1.687097 1.864081
H  -1.248756 -3.571615 0.302566
H  -0.614613 -1.316872 -3.255819
H  5.171645 -0.186634 -0.854703
H  4.064609 0.873505 -1.697259
H  3.514447 -0.443432 0.999919
H  4.100038 1.209471 0.790298
H  -1.181203 -3.439568 -2.145779
H  3.566934 -2.059652 -0.988345
H  2.359346 -1.02852 -1.710951
H  -1.885258 -3.482615 2.379796
H  -2.866356 -2.018903 2.324665
H  -1.915187 -2.400015 3.757952
H  -1.987564 1.920073 -2.352987
H  -1.556749 0.885191 -3.704476
H  -0.836947 2.483955 -3.553769
H  -2.709784 2.731897 0.398858
H  -2.456175 1.11735 -0.307503
H  3.508554 -2.395444 -3.451276
H  5.062834 -1.707782 -2.994644
H  3.826919 -0.685544 -3.717612
totalener: -1328.97351280 hartree
nucrepener: 1996.80834753 hartree
electener: -3325.78186033 hartree
oneelecener: -5784.60302769 hartree
twoeener: 2458.82116736 hartree
kineticenergy: 1324.30599999 hartree
xcener: -107.427153902642 hartree
chargesum: 0.0000000
charge: -0.126934 -0.306031 -0.365972 -0.035896 0.166784 -0.060065 -0.253503 -0.242581 -0.175591 0.071576 -0.033413 -0.004760 -0.115284 0.001825 -0.178821 0.269051 -0.052700 -0.241066 -0.226006 -0.113830 -0.261023 0.094709 0.089817 0.079925 0.092018 0.099203 0.108458 0.114694 0.113955 0.064205 0.063938 0.058911 0.087762 0.125351 0.056279 0.037357 0.076552 0.083760 0.088392 0.070046 0.076350 0.093670 0.149809 0.126707 0.084425 0.076239 0.071710
qa: -0.1269 -0.3060 -0.3660 -0.0359 0.1668 -0.0601 -0.2535 -0.2426 -0.1756 0.0716 -0.0334 -0.0048 -0.1153 0.0018 -0.1788 0.2691 -0.0527 -0.2411 -0.2260 -0.1138 -0.2610 0.0947 0.0898 0.0799 0.0920 0.0992 0.1085 0.1147 0.1140 0.0642 0.0639 0.0589 0.0878 0.1254 0.0563 0.0374 0.0766 0.0838 0.0884 0.0700 0.0764 0.0937 0.1498 0.1267 0.0844 0.0762 0.0717
va: 1.1531 1.9827 2.1446 2.9680 3.6357 3.7431 3.8408 3.8889 3.9013 3.9312 3.8439 3.7972 3.9115 3.9491 4.0673 4.1254 3.8693 3.9273 3.9208 3.9782 3.9505 1.0139 0.9962 1.0013 1.0307 0.9810 1.0235 1.0057 1.0033 1.0161 1.0152 0.9961 0.9951 1.0023 1.0144 1.0241 1.0047 1.0201 1.0069 1.0112 1.0069 1.0067 1.0034 1.0125 1.0058 1.0033 1.0039
dispcorr: -0.027844825 hartree
energy: -1329.001357625020
dipole: 22.63313 -22.09218 0.54096 -12.68012 11.50263 -1.17749 -16.70297 15.99902 -0.70396
magnitude: 1.47468 au
magnitude: 3.74833 debye
