program: Orca
programVersion: 5.0.2
elementType: Cl O O N C C C C C C C C C C C C C C C C C H H H H H H H H H H H H H H H H H H H H H H H H H H
charge: 0
multiplicity: 1
keywords: wb97x-d3
keywords: def2-TZVPP
keywords: def2/J RIJCOSX
keywords: DEFGRID2
keywords: scfconv7
keywords: smallprint printgap noloewdin
keywords: NOSOSCF
formula: C17H26ClNO2
InChI: InChI=1/C17H26ClNO2/c1-4-7-11-21-13-19(16(20)12-18)17-14(5-2)9-8-10-15(17)6-3/h8-10H,4-7,11-13H2,1-3H3
47 atoms
Cl -2.842715 0.42857 2.431524
O  2.005694 0.566014 0.326413
O  -0.828858 3.137729 1.502968
N  -0.180167 1.188274 0.57706
C  -0.505933 -0.011996 -0.12194
C  -0.39647 -1.242292 0.538866
C  -0.898177 0.067251 -1.460933
C  0.10757 -1.337352 1.955619
C  -0.944099 1.364773 -2.224973
C  1.197483 1.667289 0.547042
C  -0.718606 -2.392761 -0.172336
C  -1.220604 -1.108117 -2.131119
C  3.813851 -0.503804 -0.763996
C  3.253164 0.814759 -0.27061
C  -1.13309 -2.329977 -1.492124
C  -1.114993 2.039504 1.076278
C  2.963383 -1.162217 -1.844482
C  -0.517484 -2.451467 2.784938
C  0.273523 1.534514 -3.132454
C  -2.558356 1.562863 1.081843
C  3.537399 -2.493299 -2.30652
H  -0.052357 -0.388734 2.465161
H  1.192118 -1.470755 1.920791
H  -1.013171 2.224435 -1.55766
H  -1.849437 1.386092 -2.836762
H  1.418091 2.163547 1.498082
H  1.317329 2.416185 -0.252997
H  -0.647616 -3.358103 0.310587
H  -1.539846 -1.058586 -3.165628
H  3.929749 -1.183322 0.085998
H  4.822662 -0.319334 -1.146031
H  3.944641 1.282111 0.443598
H  3.144368 1.513959 -1.113896
H  -1.386929 -3.238865 -2.021959
H  1.946515 -1.312423 -1.476135
H  2.880201 -0.483714 -2.699706
H  -0.181993 -2.380284 3.819305
H  -0.241512 -3.444829 2.430802
H  -1.604994 -2.383597 2.781322
H  0.33601 0.727891 -3.863075
H  1.199343 1.521399 -2.55763
H  0.226953 2.478225 -3.676249
H  -3.196385 2.427861 1.241143
H  -2.847783 1.057119 0.163599
H  3.601687 -3.202113 -1.479474
H  4.541452 -2.378476 -2.718443
H  2.914388 -2.946756 -3.077163
totalener: -1328.97124916 hartree
nucrepener: 2022.34459970 hartree
electener: -3351.31584886 hartree
oneelecener: -5835.76446316 hartree
twoeener: 2484.44861430 hartree
kineticenergy: 1324.31890575 hartree
xcener: -107.430115584779 hartree
chargesum: -0.0000000
charge: -0.126608 -0.298628 -0.381985 -0.014317 0.081007 -0.037075 -0.188840 -0.184362 -0.193699 0.073322 -0.040988 -0.048769 -0.107261 -0.031621 -0.158869 0.219359 -0.041817 -0.244437 -0.241966 -0.062042 -0.264650 0.086139 0.086888 0.090056 0.090312 0.118809 0.094106 0.112229 0.111930 0.064826 0.064529 0.096225 0.066437 0.124103 0.040305 0.047125 0.088237 0.073688 0.086211 0.086431 0.062982 0.098983 0.142740 0.125317 0.075620 0.075252 0.084767
qa: -0.1266 -0.2986 -0.3820 -0.0143 0.0810 -0.0371 -0.1888 -0.1844 -0.1937 0.0733 -0.0410 -0.0488 -0.1073 -0.0316 -0.1589 0.2194 -0.0418 -0.2444 -0.2420 -0.0620 -0.2647 0.0861 0.0869 0.0901 0.0903 0.1188 0.0941 0.1122 0.1119 0.0648 0.0645 0.0962 0.0664 0.1241 0.0403 0.0471 0.0882 0.0737 0.0862 0.0864 0.0630 0.0990 0.1427 0.1253 0.0756 0.0753 0.0848
va: 1.1512 1.9730 2.1221 2.9040 3.6961 3.7248 3.8099 3.8819 3.8924 3.9446 3.8136 3.8537 3.9018 3.9485 4.0517 4.1887 3.8598 3.9190 3.9315 3.9664 3.9658 1.0166 1.0138 1.0118 1.0009 1.0074 0.9878 1.0073 1.0047 1.0135 1.0168 0.9967 0.9907 1.0024 1.0250 1.0102 1.0070 1.0023 1.0136 1.0054 0.9969 1.0108 1.0088 1.0081 1.0034 1.0029 1.0059
dispcorr: -0.029448660 hartree
energy: -1329.000697818048
dipole: 25.25199 -24.67724 0.57475 -10.87698 10.26471 -0.61226 -19.55637 18.28606 -1.27030
magnitude: 1.52278 au
magnitude: 3.87061 debye
