program: Orca
programVersion: 5.0.2
elementType: Cl O O N C C C C C C C C C C C C C C C C C H H H H H H H H H H H H H H H H H H H H H H H H H H
charge: 0
multiplicity: 1
keywords: wb97x-d3
keywords: def2-TZVPP
keywords: def2/J RIJCOSX
keywords: DEFGRID2
keywords: scfconv7
keywords: smallprint printgap noloewdin
keywords: NOSOSCF
formula: C17H26ClNO2
InChI: InChI=1/C17H26ClNO2/c1-4-7-11-21-13-19(16(20)12-18)17-14(5-2)9-8-10-15(17)6-3/h8-10H,4-7,11-13H2,1-3H3
47 atoms
Cl -2.909125 0.55513 2.4270
O  1.938697 0.424714 0.157588
O  -0.728839 3.088023 1.512219
N  -0.200087 1.124015 0.551203
C  -0.586721 -0.068117 -0.129576
C  -0.546973 -1.29024 0.550866
C  -0.977863 0.013221 -1.468965
C  -0.035315 -1.384446 1.964597
C  -0.938392 1.300556 -2.249101
C  1.204813 1.512011 0.598896
C  -0.944151 -2.431778 -0.137227
C  -1.371576 -1.151754 -2.117594
C  3.952688 -0.551116 -0.622264
C  3.31066 0.677278 -0.011465
C  -1.358509 -2.365985 -1.456384
C  -1.084654 2.021268 1.057618
C  3.385366 -0.926999 -1.986389
C  -0.700808 -2.453867 2.820413
C  0.374617 1.464238 -3.013032
C  -2.55377 1.633501 1.047743
C  4.093137 -2.127926 -2.596742
H  -0.149777 -0.421135 2.459787
H  1.042451 -1.567014 1.921244
H  -1.086703 2.167601 -1.604012
H  -1.768102 1.309776 -2.959867
H  1.466589 1.797533 1.626845
H  1.371993 2.394853 -0.03889
H  -0.932033 -3.390904 0.362909
H  -1.688533 -1.101237 -3.152645
H  3.8467 -1.393693 0.067797
H  5.026677 -0.358892 -0.707366
H  3.784026 0.918102 0.950963
H  3.463183 1.546909 -0.669158
H  -1.670598 -3.266237 -1.969706
H  2.317884 -1.137197 -1.894341
H  3.471448 -0.0699 -2.662356
H  -1.783514 -2.331301 2.83055
H  -0.347474 -2.383662 3.84888
H  -0.479557 -3.464791 2.477885
H  0.386916 2.400395 -3.571513
H  0.520501 0.647536 -3.720416
H  1.229166 1.460395 -2.338107
H  -3.143266 2.53716 1.177385
H  -2.863245 1.118184 0.14163
H  5.15752 -1.934879 -2.7418
H  3.670567 -2.38791 -3.567224
H  4.004047 -3.006634 -1.955889
totalener: -1328.97226353 hartree
nucrepener: 2005.19448018 hartree
electener: -3334.16674371 hartree
oneelecener: -5801.47947957 hartree
twoeener: 2467.31273586 hartree
kineticenergy: 1324.31142565 hartree
xcener: -107.426784177006 hartree
chargesum: -0.0000000
charge: -0.126947 -0.301565 -0.382783 -0.002103 0.070687 -0.038471 -0.204527 -0.196883 -0.174381 0.070629 -0.041839 -0.036532 -0.107368 -0.039878 -0.158596 0.223669 -0.062547 -0.244289 -0.239916 -0.067171 -0.259249 0.084794 0.085357 0.086076 0.084828 0.120406 0.108707 0.113433 0.110301 0.064546 0.062020 0.093735 0.077310 0.124539 0.060206 0.046006 0.087207 0.087842 0.074387 0.096123 0.086420 0.063198 0.142972 0.126857 0.072653 0.084827 0.075312
qa: -0.1269 -0.3016 -0.3828 -0.0021 0.0707 -0.0385 -0.2045 -0.1969 -0.1744 0.0706 -0.0418 -0.0365 -0.1074 -0.0399 -0.1586 0.2237 -0.0625 -0.2443 -0.2399 -0.0672 -0.2592 0.0848 0.0854 0.0861 0.0848 0.1204 0.1087 0.1134 0.1103 0.0645 0.0620 0.0937 0.0773 0.1245 0.0602 0.0460 0.0872 0.0878 0.0744 0.0961 0.0864 0.0632 0.1430 0.1269 0.0727 0.0848 0.0753
va: 1.1500 1.9530 2.1261 2.9013 3.7217 3.7533 3.8601 3.8943 3.9079 3.9214 3.8334 3.8476 3.9148 3.9350 4.0587 4.1817 3.8704 3.9243 3.9330 3.9672 3.9660 1.0134 1.0097 1.0094 1.0022 1.0028 0.9870 1.0065 1.0060 1.0139 1.0161 0.9983 0.9929 1.0018 1.0119 1.0068 1.0133 1.0069 1.0021 1.0100 1.0036 0.9987 1.0082 1.0085 1.0025 1.0056 1.0029
dispcorr: -0.028287894 hartree
energy: -1329.000551419348
dipole: 27.14406 -26.50887 0.63519 -10.58300 9.90522 -0.67779 -18.80600 17.70084 -1.10516
magnitude: 1.44369 au
magnitude: 3.66957 debye
