program: Orca
programVersion: 5.0.2
elementType: Cl O O N C C C C C C C C C C C C C C C C C H H H H H H H H H H H H H H H H H H H H H H H H H H
charge: 0
multiplicity: 1
keywords: wb97x-d3
keywords: def2-TZVPP
keywords: def2/J RIJCOSX
keywords: DEFGRID2
keywords: scfconv7
keywords: smallprint printgap noloewdin
keywords: NOSOSCF
formula: C17H26ClNO2
InChI: InChI=1/C17H26ClNO2/c1-4-7-11-21-13-19(16(20)12-18)17-14(5-2)9-8-10-15(17)6-3/h8-10H,4-7,11-13H2,1-3H3
47 atoms
Cl -2.666802 1.657958 2.141902
O  2.134106 -0.157716 -0.043924
O  0.63188 2.322962 1.461813
N  -0.015018 0.286786 0.702875
C  -0.96589 -0.509426 -0.004004
C  -1.733124 -1.436975 0.702946
C  -1.093647 -0.353571 -1.395477
C  -1.601075 -1.655451 2.186878
C  -0.248279 0.652507 -2.1409
C  1.256043 -0.293819 1.03178
C  -2.652167 -2.209079 -0.003983
C  -2.02579 -1.141962 -2.05641
C  4.291035 -0.442338 -1.00681
C  3.43595 -0.606363 0.233031
C  -2.800744 -2.06294 -1.36736
C  -0.223267 1.608988 0.996451
C  4.419446 0.99735 -1.490266
C  -1.003291 -3.019015 2.5294
C  -0.41836 0.666242 -3.652431
C  -1.630199 2.142267 0.769611
C  5.318868 1.113837 -2.712258
H  -2.592918 -1.57642 2.638365
H  -1.008729 -0.864945 2.645227
H  0.799524 0.476565 -1.897799
H  -0.459093 1.660503 -1.766926
H  1.09745 -1.354798 1.26486
H  1.649294 0.197681 1.928386
H  -3.264508 -2.92544 0.53108
H  -2.153609 -1.045417 -3.125605
H  3.885918 -1.069024 -1.807372
H  5.284428 -0.842159 -0.780349
H  3.427062 -1.664175 0.539386
H  3.870235 -0.036184 1.068864
H  -3.523362 -2.665594 -1.901954
H  3.431169 1.399168 -1.720881
H  4.814869 1.61836 -0.68097
H  -1.614134 -3.835256 2.143329
H  -0.92716 -3.146947 3.609336
H  -0.004098 -3.138803 2.108954
H  0.251271 1.405058 -4.091288
H  -1.432633 0.929743 -3.954666
H  -0.173755 -0.298664 -4.098086
H  -1.584985 3.227831 0.754545
H  -2.105077 1.779517 -0.138718
H  6.328427 0.758337 -2.49983
H  5.399328 2.146511 -3.051632
H  4.933071 0.523442 -3.544987
totalener: -1328.97660507 hartree
nucrepener: 1955.02084565 hartree
electener: -3283.99745071 hartree
oneelecener: -5701.13715491 hartree
twoeener: 2417.13970420 hartree
kineticenergy: 1324.30278521 hartree
xcener: -107.425284967390 hartree
chargesum: 0.0000000
charge: -0.126570 -0.309224 -0.362966 -0.032772 0.087584 -0.084132 -0.214908 -0.221630 -0.066289 0.129476 -0.046504 -0.049239 -0.133030 -0.000630 -0.171793 0.252864 -0.068619 -0.228320 -0.289816 -0.097801 -0.256508 0.094582 0.079840 0.094832 0.064320 0.092846 0.098225 0.112693 0.120719 0.064150 0.063636 0.073209 0.073249 0.124153 0.067196 0.054366 0.076891 0.090063 0.075657 0.093975 0.080229 0.089166 0.146877 0.131228 0.070854 0.086079 0.071793
qa: -0.1266 -0.3092 -0.3630 -0.0328 0.0876 -0.0841 -0.2149 -0.2216 -0.0663 0.1295 -0.0465 -0.0492 -0.1330 -0.0006 -0.1718 0.2529 -0.0686 -0.2283 -0.2898 -0.0978 -0.2565 0.0946 0.0798 0.0948 0.0643 0.0928 0.0982 0.1127 0.1207 0.0642 0.0636 0.0732 0.0732 0.1242 0.0672 0.0544 0.0769 0.0901 0.0757 0.0940 0.0802 0.0892 0.1469 0.1312 0.0709 0.0861 0.0718
va: 1.1479 1.9925 2.1455 3.0034 3.7638 3.7680 3.9686 3.9238 3.8825 3.9141 3.8733 3.8232 3.9447 3.9558 4.0853 4.1417 3.8695 3.9256 3.9589 3.9824 3.9424 1.0018 1.0221 1.0186 1.0002 0.9880 1.0073 1.0050 1.0055 1.0146 1.0145 0.9924 0.9935 1.0036 1.0145 1.0128 1.0073 1.0069 1.0070 1.0066 0.9983 0.9983 1.0056 1.0049 1.0032 1.0061 1.0028
dispcorr: -0.025237225 hartree
energy: -1329.001842292889
dipole: 26.29976 -26.31419 -0.01443 -10.78418 9.73065 -1.05353 -17.98686 17.32868 -0.65818
magnitude: 1.24230 au
magnitude: 3.15769 debye
