program: Gaussian 09
title: 000055853
version: EM64L-G09RevD.01
frameworkgroup: C1[X(C19H22N2O)]
method: RPBEPBE
basis: SDD
operation: Freq
keyword: #p
keyword: freq=noraman
keyword: PBEPBE/SDD
title: #p freq=noraman PBEPBE/SDD
converged: YES YES NO NO
title: Mulliken charges:
elementType: O N N C C C C C C C C C C C C C C C C C C C H H H H H H H H H H H H H H H H H H H H H H
charge: -0.267688 -0.277622 -0.696690 -0.130890 -0.353807 -0.423166 -0.460771 0.276897 0.286047 -0.394390 -0.456939 0.558355 -0.421459 -0.591916 0.318919 -0.372326 -0.469575 -0.392897 -0.424564 -0.431342 0.482548 -0.536903 0.245447 0.242060 0.230264 0.200913 0.223409 0.196079 0.196914 0.263971 0.223008 0.203465 0.255101 0.266248 0.225583 0.243560 0.247775 0.212641 0.213567 0.242236 0.220711 0.222619 0.302011 0.302597
chargesum: 0.00000
title: Mulliken charges with hydrogens summed into heavy atoms:
elementType: O N N C C C C C C C C C C C C C C C C C C C
charge: -0.267688 -0.013651 -0.092083 0.114557 -0.111747 -0.192903 -0.036449 0.276897 0.286047 -0.001397 -0.030466 0.558355 -0.166358 -0.325668 0.318919 -0.124551 -0.243992 -0.149337 -0.211923 -0.217775 0.482548 0.148664
polarizability: 2.71713681e+02 -7.51664347e+00 2.38202247e+02 -1.30398563e+01 -9.00017360e+00 1.57339521e+02
1716.lowfreq: -8.4810 -6.1315 -0.0008 -0.0006 -0.0005 3.2416 32.0169 40.0539 44.8718
frequency: 31.9654 40.0381 44.8622 67.0338 83.8746 113.5165 134.5801 152.4195 175.9018 186.7829 212.1459 223.4200 258.2374 284.3552 309.7164 322.9339 345.7392 350.1405 362.2635 376.8066 402.2411 411.4671 435.3904 442.5077 454.9927 473.7802 504.2666 528.6946 541.1009 576.0310 578.7732 620.8355 635.5444 658.7607 668.9242 723.6919 731.8518 753.7807 805.4573 811.8839 817.1110 821.8881 832.4004 833.5608 850.5960 862.0993 867.9576 873.7396 912.8568 924.2722 939.3765 957.1108 957.5499 969.0678 983.7691 994.1792 1001.9210 1015.8148 1043.1347 1076.3150 1081.7486 1110.5672 1113.0522 1122.0959 1127.6254 1145.6804 1157.4037 1169.7622 1187.9528 1188.3630 1205.7262 1208.2854 1212.1050 1222.8135 1250.7574 1251.7334 1276.2468 1293.9692 1301.4556 1311.7265 1316.3797 1324.1200 1331.4147 1336.1305 1343.5219 1354.6154 1384.2792 1386.6920 1418.8509 1434.5906 1437.8088 1443.9837 1451.6850 1465.1178 1465.2990 1469.9648 1471.9347 1484.8001 1518.4258 1579.3335 1593.7085 1615.9900 1631.2627 1643.3098 2939.1646 2957.3100 2960.2475 2966.0388 2967.8968 2970.7471 2987.1242 3016.5519 3028.8390 3043.6183 3043.7696 3104.2222 3109.1823 3120.9190 3128.3849 3136.0888 3138.0806 3153.4868 3167.1345 3424.7139 3568.3077 3708.8457
redmass: 4.0317 3.6862 4.3376 3.6831 3.9601 3.7359 3.6850 4.0146 2.6227 3.1701 2.7884 2.5933 1.9615 2.6075 3.7726 1.2229 2.7583 2.9620 1.0474 2.9967 3.9065 2.7609 3.7430 4.1786 3.4741 3.6657 2.9792 3.5012 2.8831 3.1575 3.9329 1.6057 6.4288 4.7123 3.3542 3.9608 3.6421 4.2548 2.8223 2.5870 1.4138 1.9484 2.1223 1.9825 1.7523 3.3036 2.5840 1.9042 2.0222 3.1746 1.5512 1.3666 1.3631 2.4080 2.4514 4.1721 2.7560 1.4427 2.0219 1.8289 2.1556 1.8898 1.2658 2.7148 1.3269 1.4741 1.4531 1.3698 1.1099 1.7694 1.6464 1.7047 1.5912 1.6314 2.0636 1.3661 1.6542 1.9643 1.3792 3.0207 1.3644 1.4952 1.3785 1.4372 1.2318 1.4027 5.8934 5.1994 2.5278 2.8485 1.1772 1.5156 1.0981 1.0499 1.0962 1.0888 1.1898 2.2481 3.0744 6.6395 8.2454 7.0099 1.9523 1.9776 1.0808 1.0329 1.0645 1.0642 1.0643 1.0803 1.0840 1.0980 1.0999 1.1025 1.1036 1.0867 1.0867 1.0994 1.0958 1.0967 1.0890 1.0904 1.0958 1.0747 1.0448 1.1041
irintensity: 0.1538 0.9579 0.2048 1.5244 0.2233 3.5123 2.2623 5.5351 2.1021 1.2677 1.8785 0.0663 0.8724 8.3033 0.6221 285.8485 16.2497 0.9128 0.1891 2.4672 1.9770 0.1187 1.6016 7.2510 6.8506 0.8545 14.2636 5.4953 16.0812 1.5495 21.5580 124.7767 0.2656 4.5485 2.6158 5.5196 0.3412 24.4616 5.4570 33.0045 2.4390 20.3089 33.7558 16.0594 29.0554 2.3015 3.3994 13.5003 0.5298 10.7463 1.2806 0.1700 0.1618 2.1484 1.9757 40.9672 0.5838 0.1772 7.2268 16.0090 13.6748 11.5170 0.2343 10.1563 33.1451 23.4264 9.2390 14.9786 24.3601 22.0585 36.7007 9.9175 14.3052 11.3255 30.9436 14.7130 37.1626 15.2464 2.6281 78.3931 3.2155 9.1382 3.5075 3.1198 0.4180 3.6431 2.8917 14.3998 16.4394 3.1571 30.4457 3.9327 9.7118 12.4203 13.2028 17.9406 82.9182 43.4377 157.4350 4.4652 13.5304 85.6627 0.2351 296.0522 11.8814 60.2194 20.8527 44.9673 35.0815 39.4707 67.7327 35.5435 105.8825 27.8387 71.8632 15.2552 28.9437 31.3491 42.7743 2.9497 9.2585 5.7782 12.6491 1.4171 75.2319 19.2030
temp: 298.150 k
press: 1.00000 atm
elementType: 8 7 7 6 6 6 6 6 6 6 6 6 6 6 6 6 6 6 6 6 6 6 1 1 1 1 1 1 1 1 1 1 1 1 1 1 1 1 1 1 1 1 1 1
symmnumber: 1
zpe: 968104.3 jmol-1
zpe.correction: 0.368731 hartree
zpe.thermalcorrener: 0.388231 hartree
zpe.thermalcorrenthalpy: 0.389175 hartree
zpe.thermalcorrgfe: 0.320870 hartree
zpe.sumelectzpe: -920.341822 hartree
zpe.sumelectthermal: -920.322322 hartree
zpe.sumelectthermalent: -920.321378 hartree
zpe.sumelectthermalfe: -920.389683 hartree
dipole: -4.9139 0.0844 0.8309
dipole: 4.9844
quadrupole: -115.0898 -125.0311 -124.7726
quadrupole: -7.2655 0.6602 -1.0811
quadrupole: 6.5413 -3.3999 -3.1414 -7.2655 0.6602 -1.0811
hfenergy: -920.7105533 hartree
pointgroup: C01 [X(C19H22N2O1)]
dipole: -1.9357372 -0.0242187 -0.3129038 debye
polarizability: 272.0044929|7.4222491|237.7110952|12.0256298|-10.6820811|157.5398604 unknown
InChI: InChI=1S/C19H22N2O/c1-22-14-8-9-15-17(11-14)18(12-4-6-13(20)7-5-12)16-3-2-10-21-19(15)16/h4-9,11,16,18-19,21H,2-3,10,20H2,1H3
charge 0 multiplicity 1
44 atoms
O  1.783845 -4.128207 -0.291155
N  2.87576 2.158885 -0.350549
N  -5.708116 -0.328713 0.40477
C  0.502954 1.784692 0.610158
C  2.049329 1.504811 0.709506
C  -0.047815 0.666845 -0.354415
C  0.151428 3.238966 0.223052
C  2.106564 -0.005905 0.540754
C  0.923552 -0.484299 -0.072034
C  1.029269 3.788124 -0.927808
C  2.528931 3.580204 -0.592433
C  -1.529347 0.369702 -0.172745
C  3.158759 -0.896124 0.843904
C  0.760651 -1.85141 -0.377197
C  1.81725 -2.741234 -0.054311
C  3.011688 -2.267539 0.551114
C  -2.487939 0.814232 -1.117302
C  -2.01148 -0.321159 0.971213
C  -3.868688 0.591746 -0.937768
C  -3.384804 -0.555663 1.167308
C  -4.342077 -0.098763 0.213749
C  0.577192 -4.67512 -0.913556
H  0.068741 1.570189 1.608743
H  2.438338 1.84905 1.688675
H  0.101404 0.998224 -1.405456
H  0.297631 3.888876 1.110663
H  -0.923935 3.301435 -0.036054
H  0.796181 3.268534 -1.880151
H  0.813904 4.863419 -1.08613
H  2.856149 1.607506 -1.220858
H  3.174804 3.962221 -1.404793
H  2.77958 4.156062 0.322192
H  4.082726 -0.529295 1.303869
H  -0.16882 -2.200603 -0.837359
H  -2.14778 1.346289 -2.015569
H  -1.294489 -0.688053 1.716262
H  3.798173 -2.99235 0.782579
H  -4.584454 0.949514 -1.688603
H  -3.726737 -1.094477 2.060254
H  0.761682 -5.756287 -0.999282
H  0.411133 -4.243672 -1.920175
H  -0.317661 -4.497152 -0.285477
H  -6.390983 0.00254 -0.26965
H  -6.043495 -0.811941 1.232364
