program: Orca
programVersion: 5.0.2
elementType: S O O O O C C C C C C C C C C C C H H H H H H H H H H H H H H H H
charge: 0
multiplicity: 1
keywords: wb97x-d3
keywords: def2-TZVPP
keywords: def2/J RIJCOSX
keywords: DEFGRID2
keywords: scfconv7
keywords: smallprint printgap noloewdin
keywords: NOSOSCF
formula: C12H16O4S
InChI: InChI=1/C12H16O4S/c1-4-17(13,14)16-9-5-6-11-10(7-9)12(2,3)8-15-11/h5-7H,4,8H2,1-3H3
33 atoms
S  -2.735595 0.53077 0.35429
O  3.456462 -1.414682 0.326968
O  -1.638241 0.204576 -0.804456
O  -2.073841 0.542627 1.644832
O  -3.413766 1.721645 -0.114218
C  3.284458 0.896547 -0.272508
C  1.945044 0.208219 -0.210767
C  4.143253 -0.15489 0.455025
C  2.154052 -1.130662 0.08927
C  3.321811 2.245863 0.428449
C  3.70943 1.040273 -1.736395
C  0.675275 0.670502 -0.480454
C  1.12149 -2.04934 0.116044
C  -0.366907 -0.248774 -0.45714
C  -0.160038 -1.587884 -0.171834
C  -3.824937 -0.874011 0.238194
C  -4.434945 -1.046773 -1.137574
H  5.14279 -0.263281 0.034873
H  4.233158 0.08176 1.519979
H  4.334329 2.653179 0.426102
H  2.677596 2.965452 -0.078775
H  2.991529 2.168865 1.464791
H  3.017891 1.688496 -2.276633
H  4.706508 1.479471 -1.805419
H  3.7320 0.075801 -2.246488
H  0.489859 1.709938 -0.723889
H  1.293206 -3.092543 0.345063
H  -0.990367 -2.282969 -0.175869
H  -3.245618 -1.745218 0.546811
H  -4.58898 -0.69553 0.997985
H  -3.683796 -1.253391 -1.89716
H  -5.111688 -1.899096 -1.103406
H  -5.014527 -0.17681 -1.439213
elementType: S O C H
totalener: -1166.09975945 hartree
nucrepener: 1421.86311203 hartree
electener: -2587.96287148 hartree
oneelecener: -4420.90651509 hartree
twoeener: 1832.94364361 hartree
cpcmener: -0.03453409 hartree
kineticenergy: 1161.84382158 hartree
xcener: -92.027876738003 hartree
chargesum: -0.0000000
charge: 0.888829 -0.352291 -0.333878 -0.514472 -0.521312 0.232837 -0.111290 0.057641 0.168654 -0.318345 -0.323080 -0.153376 -0.252212 0.166028 -0.099998 -0.109286 -0.244294 0.099033 0.087466 0.108412 0.098157 0.098852 0.097789 0.101747 0.108530 0.146445 0.147997 0.163492 0.124016 0.136145 0.100086 0.103988 0.097688
qa: 0.8888 -0.3523 -0.3339 -0.5145 -0.5213 0.2328 -0.1113 0.0576 0.1687 -0.3183 -0.3231 -0.1534 -0.2522 0.1660 -0.1000 -0.1093 -0.2443 0.0990 0.0875 0.1084 0.0982 0.0989 0.0978 0.1017 0.1085 0.1464 0.1480 0.1635 0.1240 0.1361 0.1001 0.1040 0.0977
va: 5.7496 2.0764 2.0117 1.9586 1.9637 3.8166 3.6340 3.8684 3.9503 3.9021 3.9255 4.0772 4.0629 3.7705 3.9491 3.8848 3.9259 0.9922 1.0080 1.0002 1.0029 1.0044 1.0050 1.0019 0.9997 1.0107 1.0049 0.9839 1.0085 1.0112 1.0088 0.9999 1.0114
dispcorr: -0.015740888 hartree
energy: -1166.115500336582
dipole: 9.23917 -8.75964 0.47953 0.68647 -2.05964 -1.37317 -5.07266 4.43230 -0.64036
magnitude: 1.58921 au
magnitude: 4.03946 debye
