program: Orca
programVersion: 5.0.2
elementType: S O O O O C C C C C C C C C C C C H H H H H H H H H H H H H H H H
charge: 0
multiplicity: 1
keywords: wb97x-d3
keywords: def2-TZVPP
keywords: def2/J RIJCOSX
keywords: DEFGRID2
keywords: scfconv7
keywords: smallprint printgap noloewdin
keywords: NOSOSCF
formula: C12H16O4S
InChI: InChI=1/C12H16O4S/c1-4-17(13,14)16-9-5-6-11-10(7-9)12(2,3)8-15-11/h5-7H,4,8H2,1-3H3
33 atoms
S  -2.635163 0.253328 0.534112
O  3.603038 -1.18659 0.428965
O  -1.679223 -0.300888 -0.660799
O  -2.884486 -0.835743 1.461618
O  -2.057162 1.476711 1.059678
C  3.155214 0.998571 -0.464585
C  1.90759 0.180804 -0.252874
C  4.171688 0.13185 0.30827
C  2.270682 -1.068989 0.228465
C  3.067626 2.405243 0.111378
C  3.485412 1.05125 -1.957856
C  0.588229 0.461763 -0.534429
C  1.344005 -2.07111 0.450272
C  -0.34688 -0.545277 -0.32192
C  0.010864 -1.791284 0.166445
C  -4.082439 0.610036 -0.4355
C  -4.735339 -0.62316 -1.026109
H  5.133717 0.045519 -0.19683
H  4.340316 0.525818 1.315189
H  4.023499 2.922622 0.009317
H  2.315943 2.996478 -0.413696
H  2.805483 2.388237 1.169706
H  2.697088 1.566686 -2.508668
H  4.420173 1.589363 -2.126733
H  3.592154 0.05147 -2.381932
H  0.287518 1.423764 -0.931792
H  1.635682 -3.042463 0.8268
H  -0.740861 -2.555364 0.312194
H  -4.750962 1.124646 0.25845
H  -3.778142 1.330613 -1.195896
H  -5.637793 -0.310533 -1.54958
H  -4.092055 -1.125836 -1.745238
H  -5.030379 -1.33338 -0.255925
elementType: S O C H
totalener: -1166.10029353 hartree
nucrepener: 1423.40673128 hartree
electener: -2589.50702481 hartree
oneelecener: -4424.38315971 hartree
twoeener: 1834.87613490 hartree
cpcmener: -0.03217083 hartree
kineticenergy: 1161.84723094 hartree
xcener: -92.026907329006 hartree
chargesum: -0.0000000
charge: 0.897343 -0.350297 -0.323065 -0.523296 -0.522234 0.234086 -0.102697 0.059619 0.161175 -0.320408 -0.323217 -0.174587 -0.240829 0.205595 -0.144363 -0.087410 -0.249700 0.096174 0.088113 0.108785 0.097187 0.099388 0.096839 0.102085 0.108789 0.148169 0.147503 0.154089 0.125736 0.127935 0.104869 0.104200 0.094424
qa: 0.8973 -0.3503 -0.3231 -0.5233 -0.5222 0.2341 -0.1027 0.0596 0.1612 -0.3204 -0.3232 -0.1746 -0.2408 0.2056 -0.1444 -0.0874 -0.2497 0.0962 0.0881 0.1088 0.0972 0.0994 0.0968 0.1021 0.1088 0.1482 0.1475 0.1541 0.1257 0.1279 0.1049 0.1042 0.0944
va: 5.7234 2.0782 2.0134 1.9505 1.9641 3.8180 3.6181 3.8693 3.9677 3.9086 3.9272 4.0566 4.0529 3.7459 4.0196 3.8520 3.9325 0.9928 1.0060 1.0000 1.0035 1.0036 1.0050 1.0015 0.9993 1.0131 1.0041 1.0011 1.0125 1.0165 0.9997 1.0075 1.0122
dispcorr: -0.015480569 hartree
energy: -1166.115774101105
dipole: 6.53239 -6.68134 -0.14895 7.16028 -6.29922 0.86107 -8.78370 6.85941 -1.92429
magnitude: 2.11341 au
magnitude: 5.37187 debye
