program: Orca
programVersion: 5.0.2
elementType: S O O O O C C C C C C C C C C C C H H H H H H H H H H H H H H H H
charge: 0
multiplicity: 1
keywords: wb97x-d3
keywords: def2-TZVPP
keywords: def2/J RIJCOSX
keywords: DEFGRID2
keywords: scfconv7
keywords: smallprint printgap noloewdin
keywords: NOSOSCF
formula: C12H16O4S
InChI: InChI=1/C12H16O4S/c1-4-17(13,14)16-9-5-6-11-10(7-9)12(2,3)8-15-11/h5-7H,4,8H2,1-3H3
33 atoms
S  -2.670013 0.185216 -0.539997
O  3.605958 -1.145885 -0.500501
O  -1.668207 -0.295347 0.64751
O  -2.098738 1.359098 -1.1747
O  -2.977885 -0.959668 -1.378941
C  3.150691 1.04302 0.437502
C  1.917709 0.200042 0.24558
C  4.241566 0.088583 -0.115394
C  2.279388 -1.029303 -0.283217
C  3.3771 1.352001 1.916551
C  3.086432 2.339329 -0.366274
C  0.596505 0.47141 0.53295
C  1.351025 -2.023499 -0.537298
C  -0.338483 -0.528295 0.291356
C  0.01947 -1.757284 -0.238179
C  -4.069125 0.625039 0.466523
C  -4.658433 -0.542554 1.231795
H  4.739483 0.50216 -0.994389
H  5.003187 -0.142196 0.631187
H  4.310251 1.90076 2.055987
H  2.567349 1.96646 2.312853
H  3.431244 0.440076 2.512332
H  2.275854 2.978118 -0.01229
H  4.01837 2.898413 -0.264567
H  2.924521 2.143909 -1.426881
H  0.294265 1.421715 0.956332
H  1.642489 -2.981358 -0.946322
H  -0.72943 -2.520587 -0.399022
H  -3.741685 1.43213 1.12241
H  -4.788144 1.042928 -0.241223
H  -3.968144 -0.941072 1.971577
H  -5.541064 -0.187589 1.760971
H  -4.972503 -1.345686 0.568959
elementType: S O C H
totalener: -1166.09948795 hartree
nucrepener: 1421.67007355 hartree
electener: -2587.76956150 hartree
oneelecener: -4420.88327631 hartree
twoeener: 1833.11371481 hartree
cpcmener: -0.03233352 hartree
kineticenergy: 1161.85162709 hartree
xcener: -92.028168654584 hartree
chargesum: -0.0000000
charge: 0.895024 -0.346686 -0.322802 -0.522551 -0.522693 0.256156 -0.111446 0.061101 0.160049 -0.329369 -0.327191 -0.180949 -0.229127 0.203261 -0.146662 -0.087432 -0.249086 0.087445 0.088224 0.105477 0.095921 0.106986 0.095937 0.106592 0.105267 0.148699 0.147740 0.155131 0.128376 0.125053 0.103050 0.104546 0.095960
qa: 0.8950 -0.3467 -0.3228 -0.5226 -0.5227 0.2562 -0.1114 0.0611 0.1600 -0.3294 -0.3272 -0.1809 -0.2291 0.2033 -0.1467 -0.0874 -0.2491 0.0874 0.0882 0.1055 0.0959 0.1070 0.0959 0.1066 0.1053 0.1487 0.1477 0.1551 0.1284 0.1251 0.1030 0.1045 0.0960
va: 5.7253 2.0788 2.0144 1.9621 1.9508 3.7905 3.5992 3.8797 3.9780 3.9369 3.9342 4.0642 4.0467 3.7483 4.0233 3.8541 3.9320 0.9985 0.9970 0.9998 1.0047 0.9988 1.0043 0.9995 0.9992 1.0124 1.0042 1.0018 1.0161 1.0130 1.0083 0.9994 1.0121
dispcorr: -0.015430772 hartree
energy: -1166.114918723001
dipole: 6.84327 -6.84589 -0.00261 8.00759 -7.02305 0.98454 9.17641 -7.09710 2.07930
magnitude: 2.30061 au
magnitude: 5.84769 debye
