program: Orca
programVersion: 5.0.2
elementType: S O O O O C C C C C C C C C C C C H H H H H H H H H H H H H H H H
charge: 0
multiplicity: 1
keywords: wb97x-d3
keywords: def2-TZVPP
keywords: def2/J RIJCOSX
keywords: DEFGRID2
keywords: scfconv7
keywords: smallprint printgap noloewdin
keywords: NOSOSCF
formula: C12H16O4S
InChI: InChI=1/C12H16O4S/c1-4-17(13,14)16-9-5-6-11-10(7-9)12(2,3)8-15-11/h5-7H,4,8H2,1-3H3
33 atoms
S  -2.821919 -0.273311 0.178439
O  3.580853 -1.24908 -0.022982
O  -1.591513 0.041824 1.190763
O  -2.651795 -1.597922 -0.387738
O  -3.992638 0.014023 0.980642
C  3.039978 1.052327 -0.426372
C  1.859347 0.246861 0.050151
C  4.009364 -0.095582 -0.772412
C  2.279395 -1.052824 0.293364
C  3.57484 1.907745 0.724498
C  2.736285 1.918467 -1.640024
C  0.562529 0.622543 0.326456
C  1.434005 -2.013747 0.816783
C  -0.294242 -0.341795 0.845546
C  0.123505 -1.638765 1.096214
C  -2.637672 0.953877 -1.100474
C  -3.757065 0.826107 -2.118442
H  3.961242 -0.341001 -1.837894
H  5.044856 0.119574 -0.510063
H  3.840796 1.298566 1.589896
H  4.465845 2.456324 0.413363
H  2.826832 2.634672 1.044479
H  3.643575 2.402539 -2.005696
H  2.3154 1.330209 -2.456101
H  2.023632 2.704926 -1.387759
H  0.217949 1.636451 0.159096
H  1.770608 -3.023778 1.008474
H  -0.561066 -2.360555 1.520973
H  -2.644151 1.925637 -0.606586
H  -1.660535 0.801746 -1.560934
H  -3.621688 1.600317 -2.871505
H  -3.737591 -0.13689 -2.624929
H  -4.737121 0.970129 -1.667142
elementType: S O C H
totalener: -1166.10126266 hartree
nucrepener: 1425.82939296 hartree
electener: -2591.93065562 hartree
oneelecener: -4428.23352678 hartree
twoeener: 1836.30287115 hartree
cpcmener: -0.03510498 hartree
kineticenergy: 1161.84344272 hartree
xcener: -92.028616392060 hartree
chargesum: -0.0000000
charge: 0.898119 -0.351082 -0.319291 -0.513430 -0.522906 0.237248 -0.086230 0.059213 0.160283 -0.322380 -0.322666 -0.192592 -0.240766 0.178340 -0.128533 -0.107088 -0.259656 0.088039 0.097411 0.108252 0.102660 0.096875 0.108941 0.099760 0.096834 0.162999 0.147990 0.150809 0.131726 0.131542 0.103377 0.103056 0.103148
qa: 0.8981 -0.3511 -0.3193 -0.5134 -0.5229 0.2372 -0.0862 0.0592 0.1603 -0.3224 -0.3227 -0.1926 -0.2408 0.1783 -0.1285 -0.1071 -0.2597 0.0880 0.0974 0.1083 0.1027 0.0969 0.1089 0.0998 0.0968 0.1630 0.1480 0.1508 0.1317 0.1315 0.1034 0.1031 0.1031
va: 5.7518 2.0777 2.0401 1.9506 1.9663 3.8099 3.5749 3.8700 3.9640 3.9253 3.9061 3.9825 4.0587 3.7953 3.9882 3.8436 3.9519 1.0070 0.9928 0.9999 1.0013 1.0053 1.0004 1.0038 1.0034 0.9968 1.0035 1.0037 1.0115 1.0065 0.9998 1.0085 1.0079
dispcorr: -0.015838421 hartree
energy: -1166.117101078435
dipole: 12.13660 -10.10905 2.02755 13.74307 -11.41190 2.33118 -10.99111 9.17493 -1.81618
magnitude: 3.58383 au
magnitude: 9.10937 debye
