program: Orca
programVersion: 5.0.2
elementType: S O O O O C C C C C C C C C C C C H H H H H H H H H H H H H H H H
charge: 0
multiplicity: 1
keywords: wb97x-d3
keywords: def2-TZVPP
keywords: def2/J RIJCOSX
keywords: DEFGRID2
keywords: scfconv7
keywords: smallprint printgap noloewdin
keywords: NOSOSCF
formula: C12H16O4S
InChI: InChI=1/C12H16O4S/c1-4-17(13,14)16-9-5-6-11-10(7-9)12(2,3)8-15-11/h5-7H,4,8H2,1-3H3
33 atoms
S  -2.681766 0.66586 -0.08148
O  3.41077 -1.384423 -0.727506
O  -1.639615 -0.103229 0.905911
O  -3.69428 1.152259 0.829453
O  -1.946387 1.589996 -0.920072
C  3.14866 0.9336 -0.174012
C  1.886278 0.134393 0.025436
C  4.159126 -0.220282 -0.333853
C  2.129499 -1.176349 -0.362949
C  3.500201 1.830776 1.004021
C  3.034089 1.755896 -1.460056
C  0.628796 0.521579 0.432146
C  1.136335 -2.138208 -0.361411
C  -0.37574 -0.440963 0.434675
C  -0.137491 -1.747675 0.040939
C  -3.33567 -0.645095 -1.096196
C  -4.107503 -1.687034 -0.314808
H  4.92005 -0.027852 -1.09048
H  4.659062 -0.438671 0.615465
H  4.470619 2.307541 0.851981
H  2.762653 2.625729 1.125634
H  3.545504 1.268947 1.937902
H  2.827448 1.124296 -2.325999
H  2.227818 2.487557 -1.382728
H  3.961406 2.298808 -1.655028
H  0.429099 1.535836 0.755316
H  1.33301 -3.1603 -0.657329
H  -0.939886 -2.474678 0.066827
H  -3.972269 -0.135874 -1.82412
H  -2.492679 -1.070152 -1.644055
H  -3.485256 -2.203568 0.414054
H  -4.964288 -1.255271 0.198424
H  -4.483254 -2.432301 -1.014918
elementType: S O C H
totalener: -1166.10408105 hartree
nucrepener: 1431.97416355 hartree
electener: -2598.07824461 hartree
oneelecener: -4440.80008889 hartree
twoeener: 1842.72184428 hartree
cpcmener: -0.02751047 hartree
kineticenergy: 1161.85386840 hartree
xcener: -92.029334505805 hartree
chargesum: -0.0000000
charge: 0.889578 -0.335852 -0.321822 -0.505633 -0.501593 0.227229 -0.111872 0.056450 0.162483 -0.319767 -0.321164 -0.145342 -0.245463 0.181449 -0.135258 -0.139494 -0.240524 0.094801 0.085693 0.107320 0.096911 0.098942 0.108889 0.097657 0.100298 0.143047 0.143885 0.161719 0.136642 0.131266 0.096762 0.100041 0.102722
qa: 0.8896 -0.3359 -0.3218 -0.5056 -0.5016 0.2272 -0.1119 0.0564 0.1625 -0.3198 -0.3212 -0.1453 -0.2455 0.1814 -0.1353 -0.1395 -0.2405 0.0948 0.0857 0.1073 0.0969 0.0989 0.1089 0.0977 0.1003 0.1430 0.1439 0.1617 0.1366 0.1313 0.0968 0.1000 0.1027
va: 5.7732 2.0959 2.0252 1.9859 1.9834 3.8237 3.6347 3.8743 3.9789 3.9066 3.9258 4.0274 4.0727 3.8113 3.9517 3.8920 3.9238 0.9923 1.0061 1.0005 1.0036 1.0038 0.9996 1.0053 1.0016 1.0170 1.0059 0.9869 1.0126 1.0043 1.0102 1.0117 1.0002
dispcorr: -0.016171776 hartree
energy: -1166.120252830633
dipole: 9.96831 -8.98649 0.98182 -0.00626 -1.35298 -1.35924 -3.34685 2.52399 -0.82286
magnitude: 1.86778 au
magnitude: 4.74752 debye
