program: Orca
programVersion: 5.0.2
elementType: S O O O O C C C C C C C C C C C C H H H H H H H H H H H H H H H H
charge: 0
multiplicity: 1
keywords: wb97x-d3
keywords: def2-TZVPP
keywords: def2/J RIJCOSX
keywords: DEFGRID2
keywords: scfconv7
keywords: smallprint printgap noloewdin
keywords: NOSOSCF
formula: C12H16O4S
InChI: InChI=1/C12H16O4S/c1-4-17(13,14)16-9-5-6-11-10(7-9)12(2,3)8-15-11/h5-7H,4,8H2,1-3H3
33 atoms
S  -2.864791 -0.209277 0.312951
O  3.507198 -1.278975 -0.294305
O  -1.551639 0.081549 1.23713
O  -2.769525 -1.530216 -0.26224
O  -3.966744 0.168435 1.156515
C  3.067983 1.10136 -0.343091
C  1.876981 0.275742 0.064114
C  4.100288 -0.024062 -0.63354
C  2.232506 -1.062271 0.074481
C  3.527819 2.002338 0.8039
C  2.785686 1.935197 -1.591586
C  0.604459 0.660415 0.428815
C  1.339213 -2.05003 0.450484
C  -0.300138 -0.32398 0.808128
C  0.058922 -1.664217 0.824686
C  -2.672627 0.998032 -0.99765
C  -3.806901 0.868363 -2.001364
H  4.383241 -0.049263 -1.689424
H  5.012356 0.095026 -0.044293
H  2.762247 2.738984 1.0517
H  3.733593 1.424556 1.705236
H  4.435178 2.54725 0.535476
H  2.021498 2.688737 -1.395097
H  3.683294 2.460821 -1.923561
H  2.435516 1.311879 -2.414774
H  0.311152 1.703832 0.446981
H  1.626755 -3.092208 0.459898
H  -0.657757 -2.410948 1.134759
H  -2.661327 1.979378 -0.522917
H  -1.703164 0.823802 -1.467018
H  -3.801797 -0.108101 -2.481235
H  -4.776185 1.019334 -1.529467
H  -3.690536 1.624909 -2.776042
totalener: -1166.08252741 hartree
nucrepener: 1425.21868082 hartree
electener: -2591.30120823 hartree
oneelecener: -4426.67469092 hartree
twoeener: 1835.37348269 hartree
kineticenergy: 1161.89713221 hartree
xcener: -92.033499464749 hartree
chargesum: 0.0000000
charge: 0.856633 -0.284442 -0.299309 -0.446203 -0.435977 0.170836 -0.042038 0.061224 0.134486 -0.296914 -0.301455 -0.213399 -0.185050 0.136685 -0.050545 -0.153608 -0.257290 0.070035 0.071779 0.084034 0.108468 0.094901 0.081456 0.099238 0.102633 0.123294 0.123563 0.123097 0.114089 0.109472 0.108219 0.107084 0.085002
qa: 0.8566 -0.2844 -0.2993 -0.4462 -0.4360 0.1708 -0.0420 0.0612 0.1345 -0.2969 -0.3015 -0.2134 -0.1850 0.1367 -0.0505 -0.1536 -0.2573 0.0700 0.0718 0.0840 0.1085 0.0949 0.0815 0.0992 0.1026 0.1233 0.1236 0.1231 0.1141 0.1095 0.1082 0.1071 0.0850
va: 5.8237 2.1416 2.0587 2.0218 2.0679 3.9044 3.5070 3.9192 4.0751 3.9328 3.9289 4.0190 4.0503 3.9612 3.9883 3.8979 3.9498 0.9952 0.9930 1.0089 1.0015 1.0020 1.0085 1.0030 1.0022 1.0149 1.0113 1.0148 1.0137 1.0093 1.0096 1.0088 1.0007
dispcorr: -0.015790727 hartree
energy: -1166.098318137978
dipole: 12.38605 -10.88815 1.49789 13.82235 -12.40315 1.41920 -10.39636 9.23199 -1.16436
magnitude: 2.36929 au
magnitude: 6.02226 debye
