program: Orca
programVersion: 5.0.2
elementType: S O O O O C C C C C C C C C C C C H H H H H H H H H H H H H H H H
charge: 0
multiplicity: 1
keywords: wb97x-d3
keywords: def2-TZVPP
keywords: def2/J RIJCOSX
keywords: DEFGRID2
keywords: scfconv7
keywords: smallprint printgap noloewdin
keywords: NOSOSCF
formula: C12H16O4S
InChI: InChI=1/C12H16O4S/c1-4-17(13,14)16-9-5-6-11-10(7-9)12(2,3)8-15-11/h5-7H,4,8H2,1-3H3
33 atoms
S  -2.592614 0.120756 -0.669746
O  3.602609 -1.219806 -0.014364
O  -1.640408 0.141595 0.663009
O  -1.925498 0.843945 -1.725625
O  -3.051173 -1.232631 -0.883013
C  3.243609 1.133427 0.197717
C  1.960522 0.341784 0.234444
C  4.187246 0.040787 -0.347233
C  2.281212 -1.005967 0.150696
C  3.636449 1.541871 1.62077
C  3.194042 2.35141 -0.713958
C  0.65097 0.737214 0.388942
C  1.318757 -1.993401 0.238277
C  -0.322759 -0.249695 0.4770
C  -0.003038 -1.595914 0.406996
C  -3.921644 1.111894 -0.001523
C  -4.640954 0.463818 1.166046
H  4.271455 0.113098 -1.437882
H  5.18935 0.0824 0.081241
H  3.717809 0.675042 2.277589
H  4.597023 2.061597 1.62568
H  2.891452 2.212801 2.050556
H  2.868944 2.085239 -1.7198
H  2.500557 3.100398 -0.328905
H  4.174005 2.827215 -0.786024
H  0.372672 1.782229 0.444137
H  1.578711 -3.040635 0.171018
H  -0.787062 -2.337254 0.478189
H  -3.491038 2.079939 0.255229
H  -4.592632 1.264212 -0.849686
H  -5.050466 -0.505287 0.889436
H  -3.983506 0.330994 2.02243
H  -5.468015 1.101728 1.475529
totalener: -1166.08310024 hartree
nucrepener: 1424.05868946 hartree
electener: -2590.14178971 hartree
oneelecener: -4424.88736119 hartree
twoeener: 1834.74557148 hartree
kineticenergy: 1161.89846150 hartree
xcener: -92.030768066790 hartree
chargesum: -0.0000000
charge: 0.847348 -0.291251 -0.327410 -0.439636 -0.448174 0.153347 -0.071802 0.062220 0.141523 -0.294233 -0.290953 -0.120478 -0.206653 0.169354 -0.089812 -0.129779 -0.243420 0.069148 0.077662 0.109494 0.089285 0.086782 0.101863 0.084519 0.097022 0.104001 0.121608 0.132534 0.107620 0.107844 0.102382 0.100327 0.087718
qa: 0.8473 -0.2913 -0.3274 -0.4396 -0.4482 0.1533 -0.0718 0.0622 0.1415 -0.2942 -0.2910 -0.1205 -0.2067 0.1694 -0.0898 -0.1298 -0.2434 0.0691 0.0777 0.1095 0.0893 0.0868 0.1019 0.0845 0.0970 0.1040 0.1216 0.1325 0.1076 0.1078 0.1024 0.1003 0.0877
va: 5.7908 2.1392 2.0068 2.0542 2.0303 3.9298 3.5883 3.9143 4.0507 3.9178 3.9055 4.0893 4.0771 3.9114 4.0365 3.9008 3.9230 1.0063 0.9913 1.0024 1.0040 1.0096 1.0070 1.0069 1.0026 1.0215 1.0120 1.0105 1.0201 1.0156 1.0130 1.0100 1.0009
dispcorr: -0.015494444 hartree
energy: -1166.098594684323
dipole: 7.29917 -7.24015 0.05901 11.25707 -10.04202 1.21504 6.24382 -5.32608 0.91773
magnitude: 1.52383 au
magnitude: 3.87326 debye
