program: Orca
programVersion: 5.0.2
elementType: Cl S S P O O O N C C C C C C C C C C C C C H H H H H H H H H H H H H H H H H H H
charge: 0
multiplicity: 1
keywords: wb97x-d3
keywords: def2-TZVPP
keywords: def2/J RIJCOSX
keywords: DEFGRID2
keywords: scfconv7
keywords: smallprint printgap noloewdin
keywords: NOSOSCF
formula: C13H19ClNO3PS2
InChI: InChI=1/C13H19ClNO3PS2/c1-10(2)15(12-7-5-11(14)6-8-12)13(16)9-21-19(20,17-3)18-4/h5-8,10H,9H2,1-4H3
40 atoms
Cl 4.846218 2.140456 -0.529598
S  -2.296393 0.485201 1.744411
S  -4.177089 1.877415 -0.537063
P  -2.485916 1.011171 -0.26041
O  -1.376106 -2.395555 1.41546
O  -2.16007 -0.298336 -1.121497
O  -1.154367 1.801773 -0.660489
N  0.542279 -1.825559 0.356458
C  0.698843 -3.158782 -0.253547
C  1.573823 -0.871598 0.140131
C  0.771312 -3.077698 -1.770625
C  1.890171 -3.901924 0.331428
C  -0.518461 -1.56773 1.15652
C  -0.601815 -0.178888 1.769195
C  2.599041 -0.734065 1.068465
C  1.570118 -0.07613 -1.000012
C  3.609037 0.194374 0.87028
C  2.577983 0.851167 -1.212067
C  3.588827 0.978812 -0.27218
C  -3.154685 -1.317111 -1.263094
C  -0.925166 3.120566 -0.161767
H  -0.204581 -3.705429 0.00833
H  0.742751 -4.086332 -2.184996
H  1.691461 -2.607877 -2.120977
H  -0.076163 -2.527921 -2.182303
H  2.839295 -3.429629 0.07222
H  1.823979 -3.969615 1.418085
H  1.914224 -4.919383 -0.061235
H  -0.350154 -0.266645 2.829721
H  0.080517 0.553928 1.348342
H  2.604537 -1.346137 1.961274
H  0.771388 -0.167782 -1.722818
H  4.399362 0.301243 1.600901
H  2.566801 1.468996 -2.099841
H  -4.022833 -0.939568 -1.802222
H  -2.698395 -2.119046 -1.836162
H  -3.472932 -1.706822 -0.296596
H  -1.617462 3.832794 -0.611105
H  -1.018932 3.165784 0.924844
H  0.092611 3.384152 -0.438068
elementType: Cl S P O N C H
totalener: -2385.43285582 hartree
nucrepener: 2487.64475087 hartree
electener: -4873.07760668 hartree
oneelecener: -8232.02329983 hartree
twoeener: 3358.94569314 hartree
cpcmener: -0.02981318 hartree
kineticenergy: 2379.18773247 hartree
xcener: -152.445326791924 hartree
chargesum: -0.0000000
charge: -0.089392 -0.138496 -0.432110 0.594123 -0.500471 -0.318948 -0.325460 0.000791 0.152614 0.129693 -0.308962 -0.306311 0.251000 -0.093270 -0.257257 -0.324992 -0.073630 -0.089439 0.087898 -0.123045 -0.114348 0.074101 0.107440 0.096766 0.095584 0.091739 0.101855 0.105550 0.156796 0.132449 0.152326 0.144114 0.143639 0.144971 0.128590 0.122951 0.118299 0.126618 0.112239 0.123985
qa: -0.0894 -0.1385 -0.4321 0.5941 -0.5005 -0.3189 -0.3255 0.0008 0.1526 0.1297 -0.3090 -0.3063 0.2510 -0.0933 -0.2573 -0.3250 -0.0736 -0.0894 0.0879 -0.1230 -0.1143 0.0741 0.1074 0.0968 0.0956 0.0917 0.1019 0.1055 0.1568 0.1324 0.1523 0.1441 0.1436 0.1450 0.1286 0.1230 0.1183 0.1266 0.1122 0.1240
va: 1.2154 2.3011 2.0473 5.4673 2.0109 2.0927 2.0866 2.9670 3.7475 3.5220 3.9339 3.9309 4.1728 3.8538 4.0661 4.0202 3.9262 3.9454 3.8664 3.8339 3.8412 1.0421 1.0078 0.9970 1.0071 0.9980 1.0050 1.0060 1.0035 1.0179 1.0047 1.0259 1.0054 1.0053 1.0058 0.9875 0.9997 1.0023 0.9958 0.9893
dispcorr: -0.026129065 hartree
energy: -2385.458984880103
dipole: 1.94150 0.74104 2.68253 -22.06546 21.54016 -0.52529 -3.90662 3.75388 -0.15274
magnitude: 2.73774 au
magnitude: 6.95879 debye
