program: Orca
programVersion: 5.0.2
elementType: Cl S S P O O O N C C C C C C C C C C C C C H H H H H H H H H H H H H H H H H H H
charge: 0
multiplicity: 1
keywords: wb97x-d3
keywords: def2-TZVPP
keywords: def2/J RIJCOSX
keywords: DEFGRID2
keywords: scfconv7
keywords: smallprint printgap noloewdin
keywords: NOSOSCF
formula: C13H19ClNO3PS2
InChI: InChI=1/C13H19ClNO3PS2/c1-10(2)15(12-7-5-11(14)6-8-12)13(16)9-21-19(20,17-3)18-4/h5-8,10H,9H2,1-4H3
40 atoms
Cl 4.699611 2.327175 0.746299
S  -2.368236 0.600171 -1.610682
S  -4.179311 1.560199 0.96115
P  -2.483415 0.843956 0.455074
O  -1.341559 -2.279888 -1.603079
O  -1.164252 1.659361 0.87479
O  -2.023901 -0.556488 1.089139
N  0.626228 -1.744802 -0.615313
C  0.850298 -3.121665 -0.149513
C  1.60016 -0.765357 -0.289659
C  2.063685 -3.748832 -0.822348
C  0.951877 -3.195404 1.368461
C  -0.50645 -1.451663 -1.317277
C  -0.663401 -0.009939 -1.787635
C  1.51889 -0.061327 0.906427
C  2.653637 -0.506644 -1.159305
C  2.470679 0.891877 1.227225
C  3.611326 0.445431 -0.848644
C  3.513142 1.138762 0.347579
C  -1.110979 3.056533 0.615214
C  -2.974592 -1.620461 1.148993
H  -0.035837 -3.671882 -0.460746
H  2.992643 -3.253384 -0.535747
H  1.97364 -3.716225 -1.908353
H  2.149385 -4.79581 -0.530076
H  0.084304 -2.741247 1.847758
H  0.996861 -4.239096 1.680915
H  1.848654 -2.703357 1.747265
H  0.027945 0.694828 -1.334791
H  -0.478826 0.007411 -2.864574
H  0.694283 -0.245476 1.579274
H  2.718917 -1.049153 -2.093605
H  2.399522 1.440758 2.15596
H  4.424689 0.647546 -1.531494
H  -0.11416 3.38742 0.896572
H  -1.273127 3.273818 -0.443115
H  -1.856182 3.59224 1.203843
H  -3.802515 -1.35718 1.807572
H  -3.355397 -1.870128 0.158658
H  -2.446858 -2.482669 1.548509
totalener: -2385.40581957 hartree
nucrepener: 2496.98022049 hartree
electener: -4882.38604006 hartree
oneelecener: -8250.68836060 hartree
twoeener: 3368.30232054 hartree
kineticenergy: 2379.25339474 hartree
xcener: -152.454709008543 hartree
chargesum: 0.0000000
charge: -0.066861 -0.100460 -0.362164 0.563833 -0.388144 -0.314840 -0.308437 -0.009194 0.142326 0.089195 -0.300819 -0.292830 0.202373 -0.118450 -0.287897 -0.247611 -0.091212 -0.057019 0.080127 -0.126895 -0.129171 0.083461 0.087844 0.097583 0.095315 0.087405 0.099373 0.093764 0.120831 0.134115 0.137398 0.131725 0.128675 0.125008 0.109525 0.105473 0.127675 0.129460 0.131873 0.097646
qa: -0.0669 -0.1005 -0.3622 0.5638 -0.3881 -0.3148 -0.3084 -0.0092 0.1423 0.0892 -0.3008 -0.2928 0.2024 -0.1184 -0.2879 -0.2476 -0.0912 -0.0570 0.0801 -0.1269 -0.1292 0.0835 0.0878 0.0976 0.0953 0.0874 0.0994 0.0938 0.1208 0.1341 0.1374 0.1317 0.1287 0.1250 0.1095 0.1055 0.1277 0.1295 0.1319 0.0976
va: 1.2401 2.3094 2.1170 5.4747 2.1219 2.0847 2.1020 2.9105 3.7590 3.6007 3.9374 3.9300 4.1957 3.8717 4.0223 4.0739 3.9596 3.9484 3.9536 3.8678 3.8565 1.0422 0.9983 1.0069 1.0114 1.0113 1.0115 0.9981 1.0157 1.0088 1.0350 1.0129 1.0113 1.0124 0.9892 0.9979 1.0049 1.0055 0.9957 0.9892
dispcorr: -0.026430734 hartree
energy: -2385.432250300571
dipole: 2.93767 -1.15294 1.78473 -22.20456 21.85483 -0.34973 0.90238 -0.88754 0.01484
magnitude: 1.81874 au
magnitude: 4.62286 debye
