program: Orca
programVersion: 5.0.2
elementType: Cl O O N C C C C C C C C C C C C C C H H H H H H H H H H H H H H H H H H H H
charge: 0
multiplicity: 1
keywords: wb97x-d3
keywords: def2-TZVPP
keywords: def2/J RIJCOSX
keywords: DEFGRID2
keywords: scfconv7
keywords: smallprint printgap noloewdin
keywords: NOSOSCF
formula: C14H20ClNO2
InChI: InChI=1/C14H20ClNO2/c1-4-11-7-6-8-12(5-2)14(11)16(10-18-3)13(17)9-15/h6-8H,4-5,9-10H2,1-3H3
38 atoms
Cl 0.16018 1.310597 -2.75467
O  2.486432 -0.132498 1.594043
O  1.150564 2.753124 0.095409
N  0.44639 0.66066 0.609747
C  -0.44281 -0.432858 0.362821
C  -0.030751 -1.496835 -0.452549
C  -1.700647 -0.421498 0.980515
C  1.334738 -1.541623 -1.092986
C  -2.169195 0.691611 1.881126
C  -0.920378 -2.552377 -0.640736
C  -2.557534 -1.494463 0.756347
C  -2.171597 -2.552759 -0.046708
C  1.294907 0.569399 1.790127
C  0.409902 1.805647 -0.115645
C  1.376127 -2.196819 -2.466394
C  -2.167946 0.288235 3.353628
C  -0.602672 1.892147 -1.242633
C  3.492014 0.58242 0.90353
H  1.737367 -0.534702 -1.178973
H  2.016614 -2.075302 -0.42546
H  -3.186174 0.965431 1.591692
H  -1.566521 1.590656 1.754099
H  -0.635328 -3.39067 -1.262604
H  -3.539239 -1.491933 1.215098
H  0.741677 0.016884 2.54667
H  1.481641 1.577809 2.167212
H  -2.847775 -3.381091 -0.214146
H  0.662554 -1.737024 -3.150248
H  1.165743 -3.265107 -2.430108
H  2.370639 -2.083649 -2.898395
H  -1.166203 0.035143 3.70128
H  -2.808595 -0.57668 3.528865
H  -2.536892 1.105169 3.974404
H  -0.865922 2.935547 -1.390949
H  -1.50724 1.314668 -1.08443
H  4.391257 -0.03117 0.915971
H  3.717227 1.535612 1.391638
H  3.232853 0.778699 -0.140009
elementType: Cl O N C H
totalener: -1211.03132154 hartree
nucrepener: 1577.27051161 hartree
electener: -2788.30183315 hartree
oneelecener: -4790.19368419 hartree
twoeener: 2001.89185104 hartree
cpcmener: -0.02906172 hartree
kineticenergy: 1206.93618198 hartree
xcener: -94.891990108671 hartree
chargesum: -0.0000000
charge: -0.151954 -0.384781 -0.519429 0.009673 0.070525 -0.113668 -0.143947 -0.174891 -0.156837 -0.091601 -0.072502 -0.192463 0.124108 0.313623 -0.262619 -0.261807 -0.063038 -0.125396 0.072524 0.088041 0.093214 0.083623 0.147364 0.143891 0.122654 0.119412 0.159255 0.078128 0.092143 0.095951 0.086357 0.087151 0.096174 0.152635 0.146794 0.127699 0.109044 0.094951
qa: -0.1520 -0.3848 -0.5194 0.0097 0.0705 -0.1137 -0.1439 -0.1749 -0.1568 -0.0916 -0.0725 -0.1925 0.1241 0.3136 -0.2626 -0.2618 -0.0630 -0.1254 0.0725 0.0880 0.0932 0.0836 0.1474 0.1439 0.1227 0.1194 0.1593 0.0781 0.0921 0.0960 0.0864 0.0872 0.0962 0.1526 0.1468 0.1277 0.1090 0.0950
va: 1.1243 1.9168 1.9729 2.9420 3.7286 3.7767 3.8184 3.8824 3.8713 3.7900 3.8001 3.9700 3.8917 4.0958 3.9212 3.9191 3.9588 3.8742 1.0117 1.0109 1.0006 1.0144 0.9963 0.9969 1.0003 1.0118 0.9914 1.0147 1.0018 1.0037 1.0021 1.0032 1.0044 1.0075 1.0104 0.9916 0.9962 0.9823
dispcorr: -0.022457527 hartree
energy: -1211.053779069058
dipole: -0.17334 -1.28179 -1.45513 -8.56269 7.72778 -0.83490 12.17512 -11.48218 0.69294
magnitude: 1.81511 au
magnitude: 4.61365 debye
