program: Orca
programVersion: 5.0.2
elementType: Cl O O N C C C C C C C C C C C C C C H H H H H H H H H H H H H H H H H H H H
charge: 0
multiplicity: 1
keywords: wb97x-d3
keywords: def2-TZVPP
keywords: def2/J RIJCOSX
keywords: DEFGRID2
keywords: scfconv7
keywords: smallprint printgap noloewdin
keywords: NOSOSCF
formula: C14H20ClNO2
InChI: InChI=1/C14H20ClNO2/c1-4-11-7-6-8-12(5-2)14(11)16(10-18-3)13(17)9-15/h6-8H,4-5,9-10H2,1-3H3
38 atoms
Cl -1.770835 2.2295 -1.321423
O  2.541946 -0.25433 1.489814
O  1.474581 2.609943 -0.270829
N  0.635708 0.588321 0.322733
C  -0.26826 -0.489826 0.066265
C  0.088081 -1.512331 -0.821337
C  -1.500862 -0.498769 0.733773
C  1.410054 -1.570582 -1.539989
C  -1.911842 0.558941 1.724879
C  -0.828614 -2.535283 -1.051399
C  -2.382542 -1.544275 0.478941
C  -2.055752 -2.552717 -0.411987
C  1.394633 0.539912 1.562523
C  0.740282 1.66186 -0.500315
C  2.310855 -2.678506 -1.000525
C  -2.001348 0.017781 3.149964
C  -0.122673 1.673777 -1.748702
C  3.625889 0.32707 0.791785
H  1.221926 -1.751027 -2.600737
H  1.933704 -0.617477 -1.486182
H  -2.889739 0.947663 1.432776
H  -1.232877 1.41065 1.699861
H  -0.572955 -3.323503 -1.74967
H  -3.344957 -1.556247 0.976776
H  0.765778 0.08606 2.325682
H  1.63007 1.560369 1.873468
H  -2.760107 -3.349993 -0.611166
H  1.848609 -3.658646 -1.121774
H  2.521796 -2.540014 0.05898
H  3.262153 -2.694384 -1.533241
H  -2.294732 0.807955 3.841539
H  -1.046362 -0.384029 3.490709
H  -2.740705 -0.779844 3.227554
H  -0.212596 0.708225 -2.236768
H  0.29255 2.390021 -2.452092
H  3.430435 0.439128 -0.278014
H  4.479995 -0.33828 0.908356
H  3.890692 1.306624 1.201758
elementType: Cl O N C H
totalener: -1211.03272581 hartree
nucrepener: 1582.12292815 hartree
electener: -2793.15565396 hartree
oneelecener: -4799.89081175 hartree
twoeener: 2006.73515779 hartree
cpcmener: -0.02875083 hartree
kineticenergy: 1206.93733200 hartree
xcener: -94.891941755188 hartree
chargesum: -0.0000000
charge: -0.152861 -0.389413 -0.516365 0.004795 0.131447 -0.151064 -0.157905 -0.180170 -0.154894 -0.084773 -0.077521 -0.204899 0.120490 0.305290 -0.272240 -0.260547 -0.046450 -0.135324 0.098264 0.088561 0.087791 0.078245 0.144405 0.143421 0.128212 0.119498 0.158355 0.092744 0.082426 0.097825 0.094747 0.085667 0.087474 0.142083 0.148675 0.100236 0.127556 0.116221
qa: -0.1529 -0.3894 -0.5164 0.0048 0.1314 -0.1511 -0.1579 -0.1802 -0.1549 -0.0848 -0.0775 -0.2049 0.1205 0.3053 -0.2722 -0.2605 -0.0464 -0.1353 0.0983 0.0886 0.0878 0.0782 0.1444 0.1434 0.1282 0.1195 0.1584 0.0927 0.0824 0.0978 0.0947 0.0857 0.0875 0.1421 0.1487 0.1002 0.1276 0.1162
va: 1.1209 1.9140 1.9750 2.9809 3.6026 3.7740 3.7613 3.8500 3.8877 3.8007 3.8054 3.9702 3.8816 4.1189 3.8983 3.9308 3.9571 3.8685 1.0029 1.0136 1.0019 1.0136 0.9962 0.9975 1.0003 1.0136 0.9910 1.0050 1.0211 1.0041 1.0044 1.0028 1.0037 1.0114 1.0114 0.9801 0.9896 0.9978
dispcorr: -0.022678726 hartree
energy: -1211.055404535253
dipole: 10.07836 -10.32600 -0.24763 -14.25111 12.84995 -1.40116 8.23855 -8.63522 -0.39667
magnitude: 1.47713 au
magnitude: 3.75456 debye
