program: Orca
programVersion: 5.0.2
elementType: Cl O O N C C C C C C C C C C C C C C H H H H H H H H H H H H H H H H H H H H
charge: 0
multiplicity: 1
keywords: wb97x-d3
keywords: def2-TZVPP
keywords: def2/J RIJCOSX
keywords: DEFGRID2
keywords: scfconv7
keywords: smallprint printgap noloewdin
keywords: NOSOSCF
formula: C14H20ClNO2
InChI: InChI=1/C14H20ClNO2/c1-4-11-7-6-8-12(5-2)14(11)16(10-18-3)13(17)9-15/h6-8H,4-5,9-10H2,1-3H3
38 atoms
Cl -0.913812 3.142906 -2.176952
O  1.78094 0.771096 2.044118
O  1.320212 2.325084 -0.535899
N  0.638903 0.265455 0.089787
C  -0.338199 -0.775123 0.029674
C  -0.205668 -1.762755 -0.955979
C  -1.394068 -0.796373 0.948763
C  0.924437 -1.775645 -1.950689
C  -1.567051 0.235628 2.030348
C  -1.151755 -2.781509 -1.003357
C  -2.320347 -1.832906 0.862859
C  -2.20139 -2.819524 -0.100531
C  1.846283 0.052841 0.843667
C  0.48838 1.443917 -0.574459
C  2.02829 -2.759025 -1.567828
C  -1.206564 -0.30931 3.409821
C  -0.803049 1.56692 -1.368091
C  2.983281 0.69842 2.772108
H  0.524575 -2.057792 -2.927106
H  1.353307 -0.780879 -2.074316
H  -2.609941 0.561432 2.038021
H  -0.971994 1.124711 1.826487
H  -1.066836 -3.548492 -1.764427
H  -3.149536 -1.859839 1.560366
H  2.716571 0.361876 0.252286
H  1.937224 -1.020803 1.035647
H  -2.934351 -3.614515 -0.154732
H  2.481279 -2.504783 -0.609192
H  2.82001 -2.758564 -2.318132
H  1.64418 -3.777059 -1.492391
H  -1.850662 -1.143995 3.689442
H  -1.32075 0.464934 4.169736
H  -0.174988 -0.659896 3.444326
H  -1.673042 1.460796 -0.720833
H  -0.860828 0.790815 -2.131298
H  3.822433 1.140222 2.223199
H  3.25184 -0.331925 3.030825
H  2.845801 1.257409 3.69631
elementType: Cl O N C H
totalener: -1211.04322672 hartree
nucrepener: 1541.16889297 hartree
electener: -2752.21211969 hartree
oneelecener: -4717.94726051 hartree
twoeener: 1965.73514083 hartree
cpcmener: -0.02961733 hartree
kineticenergy: 1206.94141178 hartree
xcener: -94.888063641609 hartree
chargesum: 0.0000000
charge: -0.148982 -0.361090 -0.466207 -0.029665 0.119144 -0.125388 -0.168656 -0.157577 -0.163324 -0.056833 -0.075496 -0.194119 0.106104 0.285660 -0.267343 -0.267964 -0.066279 -0.126898 0.091584 0.083703 0.094040 0.076586 0.141070 0.142146 0.115285 0.124123 0.155580 0.085733 0.096249 0.087314 0.087933 0.096434 0.078858 0.145788 0.146468 0.103148 0.095369 0.117501
qa: -0.1490 -0.3611 -0.4662 -0.0297 0.1191 -0.1254 -0.1687 -0.1576 -0.1633 -0.0568 -0.0755 -0.1941 0.1061 0.2857 -0.2673 -0.2680 -0.0663 -0.1269 0.0916 0.0837 0.0940 0.0766 0.1411 0.1421 0.1153 0.1241 0.1556 0.0857 0.0962 0.0873 0.0879 0.0964 0.0789 0.1458 0.1465 0.1031 0.0954 0.1175
va: 1.1295 1.9242 2.0440 2.9706 3.5954 3.8102 3.8219 3.8806 3.8532 3.7905 3.8057 3.9732 3.9072 4.1424 3.9148 3.9196 4.0047 3.9111 1.0004 1.0122 1.0008 1.0300 0.9977 0.9969 0.9965 0.9869 0.9918 1.0060 1.0042 1.0029 1.0046 1.0034 1.0118 1.0046 1.0026 0.9932 0.9875 0.9924
dispcorr: -0.020603534 hartree
energy: -1211.063830252627
dipole: 7.77248 -8.07939 -0.30691 -20.55010 17.73241 -2.81769 14.82324 -14.31712 0.50613
magnitude: 2.87919 au
magnitude: 7.31832 debye
