program: Orca
programVersion: 5.0.2
elementType: Cl O O N C C C C C C C C C C C C C C H H H H H H H H H H H H H H H H H H H H
charge: 0
multiplicity: 1
keywords: wb97x-d3
keywords: def2-TZVPP
keywords: def2/J RIJCOSX
keywords: DEFGRID2
keywords: scfconv7
keywords: smallprint printgap noloewdin
keywords: NOSOSCF
formula: C14H20ClNO2
InChI: InChI=1/C14H20ClNO2/c1-4-11-7-6-8-12(5-2)14(11)16(10-18-3)13(17)9-15/h6-8H,4-5,9-10H2,1-3H3
38 atoms
Cl -0.614269 1.706974 -2.590298
O  2.295197 0.028191 2.085379
O  1.381415 2.525318 -0.060748
N  0.770864 0.366736 0.259535
C  -0.232954 -0.645023 0.183795
C  -0.275394 -1.4807 -0.939369
C  -1.144279 -0.798755 1.236369
C  0.742967 -1.426371 -2.047777
C  -1.118538 0.046901 2.482639
C  -1.285372 -2.433794 -1.017253
C  -2.132833 -1.769685 1.118416
C  -2.214034 -2.575396 -0.002949
C  2.101088 -0.017978 0.712719
C  0.553718 1.648951 -0.163322
C  1.667258 -2.643591 -2.038905
C  -2.187927 1.13673 2.498212
C  -0.783977 1.943341 -0.827689
C  2.584645 1.297507 2.622086
H  0.219312 -1.379817 -3.004965
H  1.335455 -0.514497 -1.995371
H  -0.136283 0.488584 2.628337
H  -1.276817 -0.611319 3.340091
H  -1.341876 -3.071955 -1.891171
H  -2.845557 -1.896325 1.924981
H  2.830775 0.601006 0.181183
H  2.244888 -1.058625 0.424967
H  -2.994889 -3.320494 -0.081063
H  1.109279 -3.572181 -2.159781
H  2.223125 -2.721975 -1.104126
H  2.391311 -2.584137 -2.851651
H  -2.18208 1.667146 3.45048
H  -3.185818 0.720882 2.35563
H  -2.027791 1.878901 1.715759
H  -1.028229 2.989149 -0.659097
H  -1.60406 1.314275 -0.495328
H  3.375793 1.808653 2.065054
H  2.923607 1.139791 3.64487
H  1.713937 1.959092 2.645717
totalener: -1211.01991053 hartree
nucrepener: 1574.77757522 hartree
electener: -2785.79748574 hartree
oneelecener: -4784.88004156 hartree
twoeener: 1999.08255581 hartree
kineticenergy: 1206.98683438 hartree
xcener: -94.894331430041 hartree
chargesum: 0.0000000
charge: -0.123251 -0.324254 -0.372515 -0.003162 0.047518 -0.086852 -0.123656 -0.217877 -0.189294 -0.050769 -0.037858 -0.164595 0.108391 0.259260 -0.228224 -0.245878 -0.115910 -0.106829 0.094504 0.079732 0.084029 0.086967 0.114965 0.115859 0.110166 0.096180 0.125582 0.076694 0.077776 0.090546 0.093479 0.084701 0.073025 0.149634 0.132009 0.097032 0.114052 0.078825
qa: -0.1233 -0.3243 -0.3725 -0.0032 0.0475 -0.0869 -0.1237 -0.2179 -0.1893 -0.0508 -0.0379 -0.1646 0.1084 0.2593 -0.2282 -0.2459 -0.1159 -0.1068 0.0945 0.0797 0.0840 0.0870 0.1150 0.1159 0.1102 0.0962 0.1256 0.0767 0.0778 0.0905 0.0935 0.0847 0.0730 0.1496 0.1320 0.0970 0.1141 0.0788
va: 1.1522 1.9880 2.1264 2.8925 3.7955 3.7780 3.9004 3.9200 3.9259 3.8827 3.8407 4.0486 3.9644 4.1247 3.9295 3.9106 3.9892 3.9091 1.0030 1.0195 1.0206 1.0064 1.0049 1.0039 1.0046 1.0052 1.0020 1.0076 1.0063 1.0074 1.0084 1.0051 1.0070 1.0020 1.0054 0.9994 0.9885 0.9873
dispcorr: -0.022374662 hartree
energy: -1211.042285190074
dipole: 2.20543 -2.83188 -0.62645 -8.52559 7.72890 -0.79668 12.99957 -12.58487 0.41470
magnitude: 1.09505 au
magnitude: 2.78339 debye
