program: Orca
programVersion: 5.0.2
elementType: Cl O O N C C C C C C C C C C C C C C H H H H H H H H H H H H H H H H H H H H
charge: 0
multiplicity: 1
keywords: wb97x-d3
keywords: def2-TZVPP
keywords: def2/J RIJCOSX
keywords: DEFGRID2
keywords: scfconv7
keywords: smallprint printgap noloewdin
keywords: NOSOSCF
formula: C14H20ClNO2
InChI: InChI=1/C14H20ClNO2/c1-4-11-7-6-8-12(5-2)14(11)16(10-18-3)13(17)9-15/h6-8H,4-5,9-10H2,1-3H3
38 atoms
Cl -1.734946 2.226154 -1.12787
O  2.775646 -0.190885 1.128931
O  1.660143 2.411142 -0.60772
N  0.741653 0.558517 0.322474
C  -0.104776 -0.584011 0.205327
C  0.268415 -1.645359 -0.628572
C  -1.272055 -0.632955 0.98137
C  1.524301 -1.644739 -1.46583
C  -1.647535 0.489738 1.916529
C  -0.563267 -2.760276 -0.680395
C  -2.067871 -1.769023 0.898084
C  -1.719019 -2.824691 0.074012
C  1.656137 0.589241 1.427466
C  0.830756 1.534071 -0.634786
C  1.259853 -1.80369 -2.961774
C  -3.141872 0.777409 1.99987
C  -0.217882 1.503819 -1.735191
C  3.719934 -0.196663 2.161261
H  2.113518 -0.747716 -1.292843
H  2.158366 -2.468547 -1.127957
H  -1.136904 1.403248 1.615765
H  -1.272125 0.252752 2.918244
H  -0.291007 -3.596117 -1.313435
H  -2.974272 -1.834068 1.485058
H  1.139553 0.195826 2.313607
H  1.935922 1.628707 1.628869
H  -2.349891 -3.702569 0.024231
H  0.629018 -1.003922 -3.351709
H  0.766058 -2.746662 -3.196068
H  2.197228 -1.780173 -3.517551
H  -3.318561 1.664699 2.607159
H  -3.703023 -0.037845 2.455889
H  -3.558211 0.960814 1.010064
H  -0.455122 0.506307 -2.094121
H  0.134474 2.118237 -2.559173
H  3.315695 -0.611399 3.093968
H  4.105538 0.807455 2.377692
H  4.553246 -0.821153 1.844254
totalener: -1211.01849690 hartree
nucrepener: 1569.05654570 hartree
electener: -2780.07504260 hartree
oneelecener: -4773.61765801 hartree
twoeener: 1993.54261541 hartree
kineticenergy: 1206.98844967 hartree
xcener: -94.895172127287 hartree
chargesum: -0.0000000
charge: -0.128089 -0.300854 -0.361953 -0.043771 0.106548 -0.192149 -0.050484 -0.198605 -0.236505 -0.036403 -0.043839 -0.171615 0.133064 0.255335 -0.222378 -0.245770 -0.089287 -0.119784 0.087211 0.093448 0.098743 0.087806 0.115313 0.114982 0.094409 0.099581 0.124506 0.067372 0.075583 0.092996 0.088862 0.076802 0.087891 0.121498 0.148133 0.078589 0.087833 0.104979
qa: -0.1281 -0.3009 -0.3620 -0.0438 0.1065 -0.1921 -0.0505 -0.1986 -0.2365 -0.0364 -0.0438 -0.1716 0.1331 0.2553 -0.2224 -0.2458 -0.0893 -0.1198 0.0872 0.0934 0.0987 0.0878 0.1153 0.1150 0.0944 0.0996 0.1245 0.0674 0.0756 0.0930 0.0889 0.0768 0.0879 0.1215 0.1481 0.0786 0.0878 0.1050
va: 1.1525 1.9890 2.1457 2.9999 3.7319 3.8810 3.7525 3.9117 3.9040 3.8501 3.8546 4.0622 3.9021 4.1403 3.9086 3.9344 3.9781 3.9526 1.0306 1.0028 1.0118 0.9958 1.0030 1.0058 0.9840 1.0086 1.0031 1.0107 1.0078 1.0068 1.0069 1.0027 1.0158 1.0191 1.0052 0.9888 0.9907 0.9960
dispcorr: -0.021126351 hartree
energy: -1211.039623249965
dipole: 5.74297 -5.83780 -0.09483 -12.46000 11.26816 -1.19185 6.36510 -5.84719 0.51791
magnitude: 1.30296 au
magnitude: 3.31187 debye
