program: Orca
programVersion: 5.0.2
elementType: Cl O O N C C C C C C C C C C C C C C H H H H H H H H H H H H H H H H H H H H
charge: 0
multiplicity: 1
keywords: wb97x-d3
keywords: def2-TZVPP
keywords: def2/J RIJCOSX
keywords: DEFGRID2
keywords: scfconv7
keywords: smallprint printgap noloewdin
keywords: NOSOSCF
formula: C14H20ClNO2
InChI: InChI=1/C14H20ClNO2/c1-4-11-7-6-8-12(5-2)14(11)16(10-18-3)13(17)9-15/h6-8H,4-5,9-10H2,1-3H3
38 atoms
Cl -1.771614 2.274146 -1.250903
O  2.567865 -0.256533 1.455796
O  1.559461 2.539366 -0.32883
N  0.630679 0.573783 0.318831
C  -0.279784 -0.49525 0.062669
C  0.072216 -1.51626 -0.828801
C  -1.514943 -0.505954 0.723738
C  1.400301 -1.579712 -1.536404
C  -1.92732 0.548063 1.717964
C  -0.845825 -2.533566 -1.067402
C  -2.397972 -1.546867 0.460801
C  -2.073402 -2.551998 -0.431596
C  1.418066 0.517092 1.540147
C  0.764845 1.646639 -0.519241
C  2.308108 -2.66512 -0.961353
C  -1.995441 0.012817 3.147426
C  -0.152986 1.694705 -1.731975
C  3.657478 0.344249 0.799057
H  1.224951 -1.77995 -2.597053
H  1.918483 -0.622567 -1.49192
H  -2.91009 0.929285 1.431535
H  -1.259538 1.407454 1.676602
H  -0.590359 -3.320074 -1.767836
H  -3.36296 -1.557118 0.953623
H  0.80161 0.047482 2.305168
H  1.642555 1.54332 1.845989
H  -2.779133 -3.346496 -0.635693
H  1.851867 -3.651502 -1.048505
H  2.508571 -2.479957 0.091846
H  3.260359 -2.692386 -1.491993
H  -2.293584 0.799647 3.840436
H  -1.033003 -0.376414 3.480811
H  -2.717748 -0.798495 3.238238
H  -0.281591 0.733639 -2.223659
H  0.258156 2.413866 -2.435234
H  3.504006 0.441437 -0.279803
H  4.521977 -0.297303 0.963371
H  3.877672 1.340281 1.196146
totalener: -1211.02135707 hartree
nucrepener: 1582.07562670 hartree
electener: -2793.09698377 hartree
oneelecener: -4799.52833460 hartree
twoeener: 2006.43135083 hartree
kineticenergy: 1206.98447993 hartree
xcener: -94.894986828020 hartree
chargesum: -0.0000000
charge: -0.123372 -0.326909 -0.371076 -0.004893 0.124679 -0.167820 -0.116160 -0.205020 -0.208204 -0.042716 -0.038024 -0.174466 0.109518 0.218483 -0.247230 -0.230065 -0.062633 -0.126086 0.094088 0.075661 0.092005 0.082575 0.114668 0.112563 0.098911 0.111452 0.124855 0.080313 0.096629 0.085885 0.090173 0.078863 0.077224 0.123500 0.143502 0.085025 0.115904 0.108200
qa: -0.1234 -0.3269 -0.3711 -0.0049 0.1247 -0.1678 -0.1162 -0.2050 -0.2082 -0.0427 -0.0380 -0.1745 0.1095 0.2185 -0.2472 -0.2301 -0.0626 -0.1261 0.0941 0.0757 0.0920 0.0826 0.1147 0.1126 0.0989 0.1115 0.1249 0.0803 0.0966 0.0859 0.0902 0.0789 0.0772 0.1235 0.1435 0.0850 0.1159 0.1082
va: 1.1511 1.9813 2.1243 2.9048 3.6956 3.8100 3.7774 3.8965 3.9200 3.8607 3.8671 4.0618 3.9494 4.1943 3.8993 3.9307 3.9642 3.9061 1.0004 1.0174 1.0013 1.0169 1.0032 1.0050 1.0060 1.0076 1.0022 1.0090 1.0229 1.0062 1.0069 1.0065 1.0070 1.0090 1.0092 0.9832 0.9869 1.0014
dispcorr: -0.022706369 hartree
energy: -1211.044063441333
dipole: 9.98750 -10.18866 -0.20116 -14.24227 13.29413 -0.94815 8.19882 -8.33451 -0.13569
magnitude: 0.97870 au
magnitude: 2.48767 debye
