program: Orca
programVersion: 5.0.2
elementType: Cl O O N C C C C C C C C C C C C C C H H H H H H H H H H H H H H H H H H H H
charge: 0
multiplicity: 1
keywords: wb97x-d3
keywords: def2-TZVPP
keywords: def2/J RIJCOSX
keywords: DEFGRID2
keywords: scfconv7
keywords: smallprint printgap noloewdin
keywords: NOSOSCF
formula: C14H20ClNO2
InChI: InChI=1/C14H20ClNO2/c1-4-12-8-6-7-11(3)14(12)16(10-18-5-2)13(17)9-15/h6-8H,4-5,9-10H2,1-3H3
38 atoms
Cl 0.585863 -3.308454 -1.733504
O  -2.364963 0.894028 1.152175
O  -1.358568 -2.206002 0.093087
N  -0.325548 -0.277234 0.670601
C  0.810046 0.583765 0.554453
C  0.85119 1.584154 -0.418447
C  1.859039 0.403231 1.468833
C  -0.242157 1.799571 -1.429381
C  -1.342273 0.081992 1.648153
C  1.969066 2.418735 -0.453343
C  2.950898 1.257847 1.403071
C  3.005291 2.263743 0.447803
C  1.820084 -0.703432 2.479414
C  -0.418292 -1.441301 -0.019558
C  -0.992643 3.109953 -1.213957
C  0.744132 -1.717127 -0.960617
C  -3.548735 0.261908 0.675891
C  -3.643721 0.234438 -0.834549
H  0.204735 1.804876 -2.426436
H  -0.947109 0.970008 -1.418796
H  -0.84091 0.656981 2.426483
H  -1.738253 -0.82947 2.101943
H  2.021633 3.197184 -1.205366
H  3.768491 1.129252 2.101382
H  3.863949 2.921162 0.403878
H  0.978543 -0.607636 3.167802
H  1.731508 -1.682376 2.003473
H  2.730651 -0.710612 3.076328
H  -1.468231 3.140884 -0.234196
H  -1.771204 3.233989 -1.967341
H  -0.324556 3.968814 -1.286219
H  1.695357 -1.695118 -0.430895
H  0.783413 -0.965211 -1.748758
H  -3.633054 -0.74962 1.084594
H  -4.388438 0.834548 1.077593
H  -3.566343 1.23791 -1.255778
H  -2.876829 -0.390808 -1.290905
H  -4.614197 -0.170195 -1.125542
elementType: Cl O N C H
totalener: -1211.03923548 hartree
nucrepener: 1553.12145349 hartree
electener: -2764.16068897 hartree
oneelecener: -4741.86831782 hartree
twoeener: 1977.70762884 hartree
cpcmener: -0.03170543 hartree
kineticenergy: 1206.92780196 hartree
xcener: -94.889603046873 hartree
chargesum: 0.0000000
charge: -0.155746 -0.393915 -0.503458 0.020764 0.125800 -0.164548 -0.183695 -0.175261 0.088985 -0.087264 -0.055586 -0.191774 -0.257748 0.298394 -0.281517 -0.069840 0.061219 -0.280989 0.099394 0.076294 0.121148 0.125323 0.144193 0.142170 0.158854 0.106493 0.105238 0.102203 0.080893 0.097125 0.094787 0.152006 0.150883 0.076590 0.096130 0.088952 0.080090 0.107413
qa: -0.1557 -0.3939 -0.5035 0.0208 0.1258 -0.1645 -0.1837 -0.1753 0.0890 -0.0873 -0.0556 -0.1918 -0.2577 0.2984 -0.2815 -0.0698 0.0612 -0.2810 0.0994 0.0763 0.1211 0.1253 0.1442 0.1422 0.1589 0.1065 0.1052 0.1022 0.0809 0.0971 0.0948 0.1520 0.1509 0.0766 0.0961 0.0890 0.0801 0.1074
va: 1.1224 1.9187 1.9910 2.9524 3.5430 3.8101 3.9146 3.8672 3.9358 3.8000 3.7894 3.9559 3.9622 4.1105 3.9049 3.9955 3.8405 3.9227 1.0026 1.0183 0.9942 1.0002 0.9965 1.0005 0.9904 0.9958 0.9924 1.0045 1.0215 1.0018 1.0081 0.9999 1.0049 1.0106 0.9942 0.9976 1.0046 1.0122
dispcorr: -0.022006986 hartree
energy: -1211.061242469391
dipole: -8.33256 9.54013 1.20757 19.09159 -17.44600 1.64560 4.49209 -3.93556 0.55653
magnitude: 2.11564 au
magnitude: 5.37754 debye
