program: Orca
programVersion: 5.0.2
elementType: Cl O O N C C C C C C C C C C C C C C H H H H H H H H H H H H H H H H H H H H
charge: 0
multiplicity: 1
keywords: wb97x-d3
keywords: def2-TZVPP
keywords: def2/J RIJCOSX
keywords: DEFGRID2
keywords: scfconv7
keywords: smallprint printgap noloewdin
keywords: NOSOSCF
formula: C14H20ClNO2
InChI: InChI=1/C14H20ClNO2/c1-4-12-8-6-7-11(3)14(12)16(10-18-5-2)13(17)9-15/h6-8H,4-5,9-10H2,1-3H3
38 atoms
Cl 1.228011 -3.240246 -1.988813
O  -2.472802 0.308432 0.460984
O  -1.077999 -2.381964 -0.468791
N  -0.281864 -0.456943 0.407055
C  0.759649 0.518217 0.481458
C  0.828877 1.560086 -0.444964
C  1.69005 0.392048 1.522841
C  -0.159994 1.742327 -1.564248
C  -1.451482 -0.276294 1.225007
C  1.865497 2.484837 -0.310622
C  2.701278 1.337585 1.626125
C  2.790124 2.378529 0.711805
C  1.604881 -0.748539 2.491594
C  -0.188375 -1.557519 -0.383675
C  -1.064181 2.951651 -1.342327
C  1.116051 -1.677016 -1.154431
C  -3.645781 0.537327 1.22155
C  -4.634135 1.310839 0.382931
H  0.391123 1.876181 -2.498466
H  -0.772951 0.851925 -1.698548
H  -1.181173 0.370989 2.066224
H  -1.770359 -1.240082 1.635767
H  1.943454 3.296773 -1.02404
H  3.429259 1.252975 2.423356
H  3.587968 3.10488 0.797187
H  2.437248 -0.721566 3.192456
H  0.683858 -0.720628 3.075993
H  1.631122 -1.713998 1.982953
H  -1.630338 2.859116 -0.415995
H  -1.777376 3.051892 -2.161098
H  -0.48812 3.875455 -1.290134
H  1.975825 -1.587139 -0.492366
H  1.188133 -0.890131 -1.90542
H  -4.080492 -0.41777 1.543802
H  -3.403798 1.100113 2.132528
H  -5.54896 1.473183 0.952366
H  -4.238461 2.287684 0.102321
H  -4.898856 0.771001 -0.526726
elementType: Cl O N C H
totalener: -1211.04210987 hartree
nucrepener: 1528.68543083 hartree
electener: -2739.72754070 hartree
oneelecener: -4693.21025837 hartree
twoeener: 1953.48271767 hartree
cpcmener: -0.03686133 hartree
kineticenergy: 1206.94486130 hartree
xcener: -94.889877977653 hartree
chargesum: 0.0000000
charge: -0.154341 -0.378373 -0.504963 -0.037586 0.160305 -0.179972 -0.174356 -0.168097 0.103581 -0.083387 -0.051316 -0.192616 -0.262185 0.316696 -0.269054 -0.076388 0.039789 -0.258884 0.096399 0.076994 0.124898 0.113601 0.144799 0.142574 0.159197 0.102874 0.106058 0.106525 0.070681 0.098642 0.092520 0.152848 0.153572 0.085983 0.079988 0.092226 0.084214 0.086552
qa: -0.1543 -0.3784 -0.5050 -0.0376 0.1603 -0.1800 -0.1744 -0.1681 0.1036 -0.0834 -0.0513 -0.1926 -0.2622 0.3167 -0.2691 -0.0764 0.0398 -0.2589 0.0964 0.0770 0.1249 0.1136 0.1448 0.1426 0.1592 0.1029 0.1061 0.1065 0.0707 0.0986 0.0925 0.1528 0.1536 0.0860 0.0800 0.0922 0.0842 0.0866
va: 1.1235 1.9198 1.9982 3.0288 3.4941 3.8089 3.9131 3.8560 3.9120 3.8001 3.7825 3.9560 3.9671 4.1066 3.9143 4.0068 3.8747 3.9600 1.0011 1.0286 0.9859 0.9981 0.9962 1.0002 0.9902 1.0045 0.9966 0.9927 1.0159 1.0026 1.0062 0.9984 1.0043 0.9922 0.9884 1.0084 1.0002 1.0034
dispcorr: -0.020001545 hartree
energy: -1211.062111416234
dipole: -13.23941 14.15843 0.91902 22.27859 -19.91968 2.35891 10.29394 -8.64742 1.64652
magnitude: 3.01995 au
magnitude: 7.67610 debye
