program: Gaussian 09
title: 000055782
version: EM64L-G09RevD.01
frameworkgroup: C1[X(C17H12O)]
method: RPBEPBE
basis: SDD
operation: Freq
keyword: #pfreq=noraman
keyword: PBEPBE/SDD
title: #p freq=noraman PBEPBE/SDD
converged: YES YES NO NO
title: Mulliken charges:
elementType: O C C C C C C C C C C C C C C C C C H H H H H H H H H H H H
charge: -0.438642 -0.502522 0.282036 0.302661 0.230666 0.256689 0.568137 -0.613684 0.411821 -0.595856 -0.426411 -0.446962 -0.429106 -0.438723 -0.213162 -0.453557 -0.241055 -0.236807 0.251862 0.281858 0.249333 0.242112 0.251107 0.252045 0.222303 0.240107 0.199523 0.227443 0.227586 0.339196
chargesum: 0.00000
title: Mulliken charges with hydrogens summed into heavy atoms:
elementType: O C C C C C C C C C C C C C C C C C
charge: -0.099446 -0.502522 0.282036 0.302661 0.230666 0.256689 0.568137 -0.361822 0.411821 -0.313998 -0.177077 -0.204849 -0.178000 -0.186678 0.009140 -0.013927 -0.013612 -0.009221
polarizability: 2.83957942e+02 -1.40158813e+01 2.35425417e+02 4.09360122e+00 2.95314674e+00 7.79600103e+01
1716.lowfreq: -8.2771 -6.7067 -1.9967 -0.0008 -0.0005 -0.0004 46.8276 89.5578 109.2875
frequency: 46.8080 89.5532 109.2862 134.3943 151.5062 199.2555 231.2695 264.6705 295.4439 313.8587 364.8828 386.3483 433.5154 437.6175 469.5229 489.5742 505.8670 545.8996 577.8164 597.6331 612.0596 634.8271 649.0904 659.4121 721.2516 756.3929 767.9030 782.6894 797.0923 833.4113 864.8484 883.3100 890.0789 916.9488 927.1767 932.9781 950.9356 961.1938 980.5951 984.6193 985.3675 994.9843 1020.1297 1034.8166 1075.6453 1112.8355 1143.3271 1156.5637 1163.8672 1173.0131 1192.6060 1225.0885 1238.9298 1286.0939 1295.1903 1306.3317 1342.7364 1356.8903 1389.1864 1400.1102 1421.9950 1438.2573 1441.3272 1463.0574 1467.5578 1481.1940 1490.3450 1581.4847 1614.2152 1615.9244 1618.2355 1630.9748 2949.6012 3043.0912 3117.6478 3123.2636 3124.8310 3131.1876 3137.7179 3140.1680 3143.4498 3156.8943 3162.6225 3553.0987
redmass: 4.0417 3.3380 4.5540 4.4019 4.0825 4.6330 3.5523 3.0837 4.1097 5.5855 1.5627 3.0879 3.0688 4.1452 4.7422 5.1912 3.9251 5.0323 4.2482 4.8879 7.2304 3.5409 4.7207 3.4146 4.8512 1.3833 1.7670 5.6836 2.1215 2.4728 5.3340 1.5098 1.6610 1.5591 2.6774 1.8752 1.4500 3.9933 2.5205 1.4479 1.3889 2.7543 2.1078 2.3343 2.5757 2.1351 1.9876 1.5550 1.1293 1.1150 1.3345 1.4335 2.3596 1.9270 1.6934 1.6380 2.7266 1.4885 2.0068 3.7189 3.6623 3.3186 2.8534 1.5829 1.7822 4.6832 4.6700 6.3853 7.0185 7.9244 7.4719 7.5346 1.0680 1.0939 1.0914 1.0854 1.0859 1.0898 1.0922 1.0913 1.0946 1.0984 1.1002 1.0660
irintensity: 2.6483 3.6827 2.6143 0.0516 2.2402 1.7047 1.4248 11.6127 10.1987 0.4132 149.9634 46.1853 1.4289 1.3954 14.9672 5.3876 4.4413 5.5354 4.0181 2.6434 1.1066 16.8373 2.5665 1.5167 0.6853 29.5642 64.0422 1.8677 50.4440 1.2838 15.3458 10.5283 35.2200 1.6502 4.5074 4.4971 2.8511 47.6224 20.1708 3.1350 1.8256 15.1847 4.7770 4.1412 3.4791 0.0610 7.3700 17.1934 26.1917 0.0976 4.4761 4.2720 2.2435 0.6894 2.3968 5.2972 4.6093 35.2547 21.6056 4.0983 6.0649 8.0333 9.6601 4.0957 8.2680 45.5029 20.3534 0.0679 5.0005 2.2882 0.5228 4.8273 52.5764 16.6554 10.0351 3.6170 0.8574 3.0686 10.0324 2.0969 26.7750 42.5327 39.4134 9.2831
temp: 298.150 k
press: 1.00000 atm
elementType: 8 6 6 6 6 6 6 6 6 6 6 6 6 6 6 6 6 6 1 1 1 1 1 1 1 1 1 1 1 1
symmnumber: 1
zpe: 616635.4 jmol-1
zpe.correction: 0.234864 hartree
zpe.thermalcorrener: 0.248147 hartree
zpe.thermalcorrenthalpy: 0.249091 hartree
zpe.thermalcorrgfe: 0.194984 hartree
zpe.sumelectzpe: -729.041259 hartree
zpe.sumelectthermal: -729.027976 hartree
zpe.sumelectthermalent: -729.027031 hartree
zpe.sumelectthermalfe: -729.081138 hartree
dipole: 1.3719 -0.0083 0.8170
dipole: 1.5967
quadrupole: -105.1162 -87.5607 -107.7806
quadrupole: -1.0867 -3.3383 0.0736
quadrupole: -4.9637 12.5918 -7.6281 -1.0867 -3.3383 0.0736
hfenergy: -729.2761228 hartree
pointgroup: C01 [X(C17H12O1)]
dipole: -0.5422416 0.0209353 0.3165173 debye
polarizability: 284.2598198|-13.6885821|233.9369526|-1.4780629|-14.237271|79.1465976 unknown
InChI: InChI=1S/C17H12O/c18-10-11-8-12-4-3-7-15-13-5-1-2-6-14(13)16(9-11)17(12)15/h1-9,18H,10H2
charge 0 multiplicity 1
30 atoms
O  4.937879 1.332188 0.32194
C  0.244538 -0.616582 -0.009005
C  0.067738 0.79927 -0.129861
C  -1.012928 -1.294855 0.082738
C  -1.397117 1.037106 -0.11244
C  -2.056964 -0.242048 0.016262
C  1.507725 -1.257238 0.021106
C  1.206217 1.604391 -0.22031
C  2.509803 0.987608 -0.203171
C  2.661143 -0.40682 -0.081753
C  -1.005099 -2.688349 0.20719
C  1.488433 -2.690194 0.1497
C  -2.152709 2.220938 -0.197505
C  -3.461252 -0.315859 0.057961
C  0.261645 -3.369605 0.237652
C  3.741004 1.880503 -0.32964
C  -3.567979 2.13692 -0.154226
C  -4.214581 0.882931 -0.027998
H  1.13431 2.696126 -0.303603
H  3.671367 -0.831865 -0.077942
H  -1.930625 -3.269968 0.281411
H  2.430136 -3.250759 0.177605
H  -1.663654 3.196409 -0.296515
H  -3.972661 -1.279852 0.155378
H  0.263956 -4.46139 0.33393
H  4.044579 1.98475 -1.386945
H  3.509162 2.897231 0.054668
H  -4.168626 3.050908 -0.21939
H  -5.308943 0.840007 0.0032
H  4.730302 1.164298 1.276663
