program: Orca
programVersion: 5.0.2
elementType: Cl O O N C C C C C C C C C C C C C C H H H H H H H H H H H H H H H H H H H H
charge: 0
multiplicity: 1
keywords: wb97x-d3
keywords: def2-TZVPP
keywords: def2/J RIJCOSX
keywords: DEFGRID2
keywords: scfconv7
keywords: smallprint printgap noloewdin
keywords: NOSOSCF
formula: C14H20ClNO2
InChI: InChI=1/C14H20ClNO2/c1-4-12-8-6-7-11(3)14(12)16(10-18-5-2)13(17)9-15/h6-8H,4-5,9-10H2,1-3H3
38 atoms
Cl 0.575329 -2.968916 -2.11456
O  -2.335416 0.957557 1.247025
O  -1.373181 -2.140607 -0.157434
N  -0.374899 -0.269104 0.647348
C  0.751009 0.605779 0.646015
C  0.797105 1.714041 -0.203748
C  1.785842 0.334942 1.552852
C  -0.293733 2.021881 -1.197363
C  -1.419543 -0.01365 1.627711
C  1.900954 2.56012 -0.113699
C  2.869296 1.199823 1.605973
C  2.924349 2.311252 0.780173
C  1.734226 -0.870107 2.447715
C  -0.452612 -1.362701 -0.173554
C  0.21722 2.28749 -2.611066
C  0.73267 -1.516171 -1.124136
C  -3.338123 0.564753 0.328432
C  -4.348701 -0.415075 0.895511
H  -1.012908 1.206129 -1.229349
H  -0.856238 2.889439 -0.84233
H  -0.93745 0.374203 2.525462
H  -1.889606 -0.968553 1.871234
H  1.956578 3.432971 -0.751714
H  3.675714 1.002025 2.301007
H  3.77039 2.983594 0.834368
H  2.650337 -0.958098 3.028613
H  0.906953 -0.822046 3.156922
H  1.612837 -1.798887 1.888881
H  -0.618122 2.456797 -3.290094
H  0.789058 1.442117 -2.996507
H  0.859176 3.16606 -2.666028
H  1.672355 -1.570708 -0.574214
H  0.803679 -0.653132 -1.786252
H  -3.840027 1.492863 0.049738
H  -2.901718 0.153071 -0.589011
H  -5.155699 -0.558733 0.17633
H  -3.913839 -1.396284 1.082025
H  -4.786961 -0.03984 1.820481
totalener: -1211.02539046 hartree
nucrepener: 1545.83521272 hartree
electener: -2756.86060318 hartree
oneelecener: -4726.96447384 hartree
twoeener: 1970.10387066 hartree
kineticenergy: 1206.98579256 hartree
xcener: -94.896576269337 hartree
chargesum: 0.0000000
charge: -0.104408 -0.323059 -0.357580 -0.019924 0.115737 -0.163069 -0.208446 -0.197875 0.083225 -0.043875 -0.014814 -0.158486 -0.237163 0.218526 -0.222410 -0.071025 0.025100 -0.256542 0.068844 0.099344 0.100180 0.121753 0.114588 0.109412 0.126700 0.090914 0.095762 0.095381 0.090558 0.077363 0.078702 0.122625 0.118534 0.093961 0.075138 0.078951 0.091355 0.086022
qa: -0.1044 -0.3231 -0.3576 -0.0199 0.1157 -0.1631 -0.2084 -0.1979 0.0832 -0.0439 -0.0148 -0.1585 -0.2372 0.2185 -0.2224 -0.0710 0.0251 -0.2565 0.0688 0.0993 0.1002 0.1218 0.1146 0.1094 0.1267 0.0909 0.0958 0.0954 0.0906 0.0774 0.0787 0.1226 0.1185 0.0940 0.0751 0.0790 0.0914 0.0860
va: 1.1707 1.9935 2.1390 2.8983 3.6492 3.8985 3.9624 3.9199 3.9741 3.8459 3.8520 4.0360 3.9760 4.1437 3.9145 4.0300 3.8928 3.9221 1.0180 1.0038 0.9974 0.9906 1.0069 1.0091 1.0019 1.0074 0.9980 0.9972 1.0077 1.0057 1.0072 1.0077 1.0153 0.9876 0.9917 1.0123 1.0101 1.0065
dispcorr: -0.021135457 hartree
energy: -1211.046525914968
dipole: -7.26857 7.97090 0.70233 15.25204 -14.01898 1.23306 6.02728 -5.54535 0.48193
magnitude: 1.49865 au
magnitude: 3.80926 debye
