program: Gaussian 09
title: 000055901
version: EM64L-G09RevD.01
frameworkgroup: C1[X(C19H30N2O3)]
method: RPBEPBE
basis: SDD
operation: Freq
keyword: #p
keyword: freq=noraman
keyword: PBEPBE/SDD
title: #p freq=noraman PBEPBE/SDD
converged: YES YES NO NO
title: Mulliken charges:
elementType: O O O N N C C C C C C C C C C C C C C C C C C C H H H H H H H H H H H H H H H H H H H H H H H H H H H H H H
charge: -0.383349 -0.341898 -0.408391 -0.128690 -0.359819 -0.011015 -0.473479 -0.468608 -0.365512 -0.464321 -0.328727 -0.696507 0.184986 -0.006464 0.048324 -0.043138 0.433800 0.413110 -0.621741 -0.529191 -0.509671 -0.682384 -0.691931 -0.527083 0.254483 0.210190 0.213741 0.222537 0.219049 0.228523 0.175132 0.251620 0.235560 0.230798 0.180908 0.364052 0.218078 0.211676 0.224643 0.246069 0.203495 0.207922 0.197208 0.231660 0.239088 0.212557 0.219922 0.209720 0.212274 0.254767 0.384460 0.232934 0.232323 0.236310
chargesum: 0.00000
title: Mulliken charges with hydrogens summed into heavy atoms:
elementType: O O O N N C C C C C C C C C C C C C C C C C C C
charge: -0.383349 -0.341898 -0.023932 -0.128690 0.004233 0.243468 -0.049547 -0.027022 0.038143 0.022859 0.082979 -0.042110 0.184986 -0.006464 0.048324 -0.043138 0.433800 0.413110 -0.375672 -0.117774 -0.080802 -0.010817 -0.015170 0.174484
polarizability: 3.13937293e+02 -5.32090164e+00 2.57235535e+02 6.67646044e+00 -3.54048600e+00 1.56339051e+02
1716.lowfreq: -5.4203 -4.5701 -0.0007 0.0006 0.0007 2.5251 16.2468 24.3617 28.0109
frequency: 16.1144 24.2959 27.8436 30.6257 57.9979 60.0695 66.3171 72.3601 80.4346 92.6438 121.6599 128.4652 143.7903 156.5602 161.9381 177.3799 195.5459 205.8269 218.4918 229.6021 240.4611 250.7423 267.7473 295.3453 308.2063 320.2886 328.9753 339.8374 361.0324 378.3328 400.5746 409.3717 428.2171 442.0732 484.6971 505.4259 528.3575 537.0738 566.7419 603.5846 612.8786 659.7053 701.8780 711.3098 731.3597 777.2370 784.9206 791.9330 796.4161 799.3983 810.9497 820.7435 837.6304 864.7306 880.1987 906.4030 910.1731 912.4992 932.7318 959.1394 969.9672 979.8236 982.8749 995.0989 1008.0037 1035.6318 1057.6705 1064.3775 1071.8101 1077.0806 1079.7352 1087.5799 1093.6755 1096.5049 1111.2486 1122.5595 1145.8372 1148.8811 1162.3570 1183.2831 1191.2502 1204.5585 1223.7072 1226.6758 1248.1221 1251.8565 1255.1576 1277.9758 1289.3156 1293.2196 1294.9213 1297.0577 1310.4488 1313.1185 1322.1055 1334.1280 1340.9839 1342.7840 1354.4304 1377.4993 1382.8280 1383.5016 1388.4161 1395.6597 1404.2895 1429.8907 1437.7991 1443.9629 1456.7492 1464.5501 1466.6500 1467.5173 1468.7456 1471.5833 1473.0069 1473.7931 1474.4355 1476.0780 1487.7205 1488.3522 1490.3244 1497.4074 1530.7397 1565.6633 1607.6851 1633.1702 2606.5322 2838.1742 2847.0841 2928.4967 2969.5114 2981.0605 2982.2384 2983.4981 2992.9046 2995.0049 2997.3445 3009.6241 3018.2038 3023.7137 3034.9505 3045.8881 3048.8384 3052.3964 3067.1219 3076.3833 3077.7771 3078.6062 3081.0402 3086.9848 3088.3189 3091.8768 3098.0099 3111.8783 3115.6821 3389.6646
redmass: 3.8320 3.2406 2.9442 3.9890 2.9272 2.9226 3.4828 2.6316 3.3859 3.5270 3.1584 6.3315 2.7755 1.1157 2.0149 3.6309 1.9877 1.3943 1.7475 2.0810 1.6962 2.1846 1.9212 1.7239 3.0026 3.1209 5.4768 2.3241 5.1238 3.6514 5.6388 5.4944 4.3299 3.5030 4.7728 4.0673 4.4880 4.3995 2.4907 2.4661 3.1480 4.7951 5.5913 6.4763 4.1216 1.4214 3.1575 1.1962 1.3084 1.5064 1.7248 1.9138 3.7356 2.6642 2.4209 2.0814 1.6531 3.4111 2.2689 2.0272 2.3173 3.0808 1.0722 1.7802 2.1117 2.0863 2.9200 1.9644 2.1116 1.9651 1.6315 2.4697 2.1575 1.9023 1.2485 2.0643 1.4053 1.8151 1.5303 2.7719 2.0968 2.5940 1.4452 1.3587 1.3356 1.3054 1.3843 1.2438 3.5392 1.6562 1.2810 1.3541 1.3088 1.4107 2.5753 2.2940 1.4089 1.3583 1.4020 1.3474 1.2486 1.2746 1.2779 3.6914 2.6064 1.2687 1.5485 1.4448 1.0582 1.0854 1.0783 1.1363 1.0468 1.0468 1.0823 1.0618 1.0527 1.0722 1.0692 1.0782 1.0651 1.0911 2.0036 6.1947 5.4498 2.9990 1.0734 1.0722 1.0710 1.0839 1.0308 1.0349 1.0354 1.0354 1.0597 1.0605 1.0596 1.0648 1.0591 1.0878 1.0877 1.1005 1.1012 1.1019 1.1030 1.1002 1.0998 1.0989 1.1047 1.1058 1.1004 1.1014 1.1007 1.0913 1.1033 1.0805
irintensity: 0.5228 0.2442 0.0465 0.3059 0.3979 0.8585 1.7876 0.5140 0.4176 1.8559 1.3997 0.2132 6.2011 0.7695 0.9421 0.2684 0.6960 0.2650 2.5727 1.8810 4.8716 0.2461 5.2840 1.9208 1.1432 0.6347 8.3557 3.2587 4.0977 2.2976 0.4982 22.5856 7.9625 16.4875 20.3231 7.6637 1.4152 8.6476 7.3311 0.6253 17.8643 1.9247 0.9958 3.8423 9.8412 8.3124 0.4866 6.7302 7.8439 26.0858 45.7198 7.2201 19.6679 1.8979 5.2214 1.0707 8.8046 34.9066 8.4981 1.8503 7.1940 33.7150 112.0151 2.7458 2.9968 3.3801 1.8812 13.2392 31.5432 9.3356 5.8021 82.9923 11.9174 15.3986 0.7140 8.8244 5.1315 34.4596 6.9427 14.1830 11.1516 35.9228 27.8045 1.8962 38.9543 7.9963 30.0145 11.3547 27.5521 63.4140 22.5043 1.2955 0.8138 3.2895 24.0326 94.3561 0.9358 3.1965 8.8977 0.4079 6.7228 28.7080 25.3715 31.1149 4.0099 9.9528 174.1362 133.8083 17.5608 6.5732 3.1028 21.2440 9.2561 7.1137 1.5574 10.1699 14.3247 18.0487 5.1597 12.6719 11.5576 6.8694 427.6735 134.4091 27.3898 70.6419 723.7641 53.8146 180.8533 30.3668 48.3790 38.7019 52.4645 35.0719 33.3243 44.7225 49.8679 29.4350 34.6712 19.7842 57.4761 9.8133 7.2110 27.4656 35.2317 62.9016 49.2707 53.6516 50.0228 16.7220 41.0654 30.4577 26.8305 22.0078 21.9584 147.5054
temp: 298.150 k
press: 1.00000 atm
elementType: 8 8 8 7 7 6 6 6 6 6 6 6 6 6 6 6 6 6 6 6 6 6 6 6 1 1 1 1 1 1 1 1 1 1 1 1 1 1 1 1 1 1 1 1 1 1 1 1 1 1 1 1 1 1
symmnumber: 1
zpe: 1212235.4 jmol-1
zpe.correction: 0.461716 hartree
zpe.thermalcorrener: 0.487923 hartree
zpe.thermalcorrenthalpy: 0.488867 hartree
zpe.thermalcorrgfe: 0.402994 hartree
zpe.sumelectzpe: -1075.342179 hartree
zpe.sumelectthermal: -1075.315972 hartree
zpe.sumelectthermalent: -1075.315028 hartree
zpe.sumelectthermalfe: -1075.400902 hartree
dipole: 0.8036 -4.6683 -1.3908
dipole: 4.9369
quadrupole: -133.5140 -145.5123 -147.0303
quadrupole: 1.8816 -1.2892 3.9530
quadrupole: 8.5049 -3.4934 -5.0115 1.8816 -1.2892 3.9530
hfenergy: -1075.8038955 hartree
pointgroup: C01 [X(C19H30N2O3)]
dipole: -0.3143098 -1.8868255 0.3371509 debye
polarizability: 314.32917|4.7415412|254.9104363|1.1038038|15.162726|158.2722728 unknown
InChI: InChI=1S/C19H30N2O3/c1-5-13-11-14(6-2)18(24-4)16(17(13)22)19(23)20-12-15-9-8-10-21(15)7-3/h11,15,20,22H,5-10,12H2,1-4H3
charge 0 multiplicity 1
54 atoms
O  -0.573342 1.739757 0.092573
O  1.012198 -2.17675 -0.605473
O  1.729495 2.564121 0.550726
N  -4.646843 0.29017 -0.064775
N  -0.974865 -0.353146 -0.813103
C  -3.286137 -0.265926 0.210102
C  -3.521622 -1.761568 0.579725
C  -4.985077 -2.044781 0.144842
C  -5.670089 -0.684729 0.386576
C  -2.397166 -0.055776 -1.048246
C  -4.844485 1.692792 0.358453
C  -6.096436 2.331245 -0.270817
C  -0.131124 0.559203 -0.244195
C  1.312462 0.221256 -0.067816
C  1.880254 -1.073484 -0.28378
C  2.202433 1.296039 0.290191
C  3.267711 -1.312113 -0.219772
C  3.610264 1.079739 0.387425
C  4.101309 -0.210151 0.119958
C  3.874324 -2.663434 -0.569794
C  4.526705 2.236466 0.740963
C  4.040577 -2.847447 -2.102413
C  4.764998 3.193294 -0.458594
C  0.594112 -2.953243 0.587559
H  -2.794912 0.269641 1.052641
H  -2.793111 -2.433077 0.089117
H  -3.420637 -1.903909 1.671601
H  -5.452804 -2.864655 0.716727
H  -5.032399 -2.300197 -0.929425
H  -6.60748 -0.571968 -0.186832
H  -5.91741 -0.563137 1.472999
H  -2.488149 0.997489 -1.365485
H  -2.764555 -0.698836 -1.867441
H  -3.949439 2.267156 0.054272
H  -4.908569 1.771345 1.475449
H  -0.553752 -1.255441 -1.07785
H  -7.022099 1.823064 0.055582
H  -6.175474 3.393942 0.023125
H  -6.041727 2.27285 -1.372327
H  5.184474 -0.378716 0.182009
H  3.2493 -3.491031 -0.188076
H  4.862536 -2.755124 -0.080087
H  5.496452 1.841775 1.099156
H  4.075666 2.819356 1.565024
H  3.057573 -2.800516 -2.602777
H  4.502233 -3.825168 -2.334095
H  4.680521 -2.053744 -2.528341
H  5.227479 2.658584 -1.308409
H  5.433994 4.023906 -0.167324
H  3.807406 3.624408 -0.796559
H  0.686876 2.512898 0.454452
H  0.032134 -3.81886 0.203196
H  1.476839 -3.297078 1.155657
H  -0.050425 -2.337692 1.244305
