program: Gaussian 09
title: 000006386
version: EM64L-G09RevD.01
frameworkgroup: C1[X(C4H10O)]
method: RPBEPBE
basis: SDD
operation: Freq
keyword: #pfreq=noraman
keyword: PBEPBE/SDD
title: #p freq=noraman PBEPBE/SDD
converged: NO NO NO NO
title: Mulliken charges:
elementType: O C C C C H H H H H H H H H H
charge: -0.458403 0.268957 -0.697735 -0.696817 -0.681714 0.200797 0.208183 0.235341 0.235300 0.200787 0.207820 0.228946 0.194054 0.228903 0.325579
chargesum: 0.00000
title: Mulliken charges with hydrogens summed into heavy atoms:
elementType: O C C C C
charge: -0.132823 0.268957 -0.053414 -0.052910 -0.029810
polarizability: 4.95216058e+01 1.87399132e-02 4.67665196e+01 1.20258007e+00 6.95082148e-03 4.76809307e+01
1716.lowfreq: -6.1054 -0.0003 -0.0001 0.0003 14.2093 23.2768 163.8838 233.4887 251.4567
frequency: 163.7998 233.4594 251.4505 309.5369 322.7710 332.4819 401.4600 437.1036 438.0966 725.3392 869.9959 900.3070 915.8994 941.3321 1007.8434 1020.6177 1124.6115 1205.4674 1247.6728 1336.4262 1372.0489 1376.5743 1399.6589 1446.8009 1456.3702 1461.3463 1471.5161 1477.4338 1489.3081 2967.4742 2972.1526 2990.8267 3058.0305 3066.4761 3083.8337 3086.2456 3094.8923 3098.5438 3535.6069
redmass: 1.0151 1.0522 1.0425 1.3179 2.3440 1.6714 2.1678 2.5271 2.8780 4.2867 2.9691 1.6371 1.6486 1.2066 1.3671 1.4127 1.3555 2.3907 2.9752 1.8243 1.2312 1.3143 1.2261 1.0485 1.0489 1.0471 1.0638 1.0826 1.0545 1.0363 1.0362 1.0355 1.0985 1.0977 1.1005 1.0999 1.0995 1.1000 1.0657
irintensity: 1.2311 4.7328 0.1155 54.6116 1.8136 89.4529 0.8202 11.0890 8.2426 5.7118 29.7999 0.8844 1.8573 0.0028 13.2847 0.8420 75.6044 44.3385 41.5391 23.8729 32.1604 42.0620 7.3510 0.2386 0.4968 0.9825 5.3916 9.6927 21.0635 21.5609 33.8807 14.2185 2.2719 72.5986 10.9870 6.1357 66.0972 41.9856 4.8251
temp: 298.150 k
press: 1.00000 atm
elementType: 8 6 6 6 6 1 1 1 1 1 1 1 1 1 1
symmnumber: 1
zpe: 347460.2 jmol-1
zpe.correction: 0.132341 hartree
zpe.thermalcorrener: 0.139331 hartree
zpe.thermalcorrenthalpy: 0.140275 hartree
zpe.thermalcorrgfe: 0.103021 hartree
zpe.sumelectzpe: -233.204909 hartree
zpe.sumelectthermal: -233.197919 hartree
zpe.sumelectthermalent: -233.196975 hartree
zpe.sumelectthermalfe: -233.234229 hartree
dipole: 1.4743 0.0134 -1.2436
dipole: 1.9288
quadrupole: -31.4109 -33.0696 -34.1685
quadrupole: 0.0133 3.3389 0.0216
quadrupole: 1.4721 -0.1866 -1.2855 0.0133 3.3389 0.0216
hfenergy: -233.3372501 hartree
pointgroup: C01 [X(C4H10O1)]
dipole: -0.5108356 0.2780746 -0.487435 debye
dipolederiv: -0.3055315 -0.2161018 -0.0080626 -0.2173668 -0.5351625 -0.00501 -0.0196828 0.0022667 -0.8526327 0.4033238 0.0781333 -0.0266646 0.0790364 0.4894804 0.0233272 -0.0144136 0.015557 0.6835326 -0.1233817 -0.1112855 -0.0911318 -0.1012519 -0.0458266 -0.0311016 -0.0143524 -0.0053084 -0.0183362 0.0235348 -0.0242204 -0.0146943 -0.0294375 -0.1842482 0.1104605 -0.0014571 0.0294937 -0.0265936 -0.0948561 0.0695282 0.0520241 0.066455 -0.0281424 -0.0305686 -0.0017174 0.0024869 0.0347649 -0.1158856 0.0828411 0.0422879 0.1349264 0.0051741 -0.0600883 0.0737176 -0.0525323 0.0609596 0.0819723 -0.0089457 0.0065006 -0.0129417 0.0927427 -0.0199584 -0.029781 -0.0388209 -0.1732221 0.0780095 -0.003692 -0.0133636 -0.0434405 -0.1291703 0.0768058 0.0076514 0.097551 0.0616993 -0.0732134 -0.1256341 -0.0575748 -0.0853098 0.0098058 -0.0148589 -0.0695747 -0.0409723 0.0742134 -0.1017525 0.1418463 0.0698752 0.0921723 -0.0055062 -0.0093394 0.081618 -0.0430954 0.0575681 0.1006456 -0.0010933 0.0068794 0.0008434 0.0774656 -0.0169593 0.0068198 0.0242334 -0.1771441 0.0870747 -0.011709 0.0206253 0.0251973 -0.1343308 0.0769921 -0.0005421 0.0949511 0.0701944 0.0829567 0.0085156 -0.0152333 0.0111336 0.0914927 -0.0059739 0.0300233 -0.0333816 -0.1678577 -0.0994565 -0.0744953 -0.0442789 -0.1138656 0.0381644 -0.0452577 -0.0666741 -0.0367785 0.0840834 0.0565601 0.1963127 0.0728113 0.1938494 0.2580611 -0.0484695 0.0183651 -0.0156506 0.2887704 unknown
polarizability: 48.7403482|-1.2384589|47.5447492|-1.0109862|0.6575569|47.6839588 unknown
InChI: InChI=1S/C4H10O/c1-4(2,3)5/h5H,1-3H3
charge 0 multiplicity 1
15 atoms
O  0.057072 0.045364 1.468143
C  -0.009393 0.004153 -0.019211
C  -1.298403 -0.730601 -0.455578
C  0.024622 1.447178 -0.574287
C  1.249432 -0.783189 -0.423586
H  -2.200152 -0.168966 -0.141708
H  -1.338763 -0.845531 -1.55458
H  -1.335723 -1.733816 0.004489
H  0.919312 1.975037 -0.199586
H  -0.872725 2.014788 -0.258544
H  0.052016 1.44718 -1.679657
H  1.225475 -1.79032 0.027322
H  1.312645 -0.884311 -1.522185
H  2.153221 -0.264361 -0.060157
H  -0.736337 0.538495 1.804025
