program: Gaussian 09
title: 000006384
version: EM64L-G09RevD.01
frameworkgroup: C1[X(CBrF3)]
method: RPBEPBE
basis: SDD
operation: Freq
keyword: #pfreq=noraman
keyword: PBEPBE/SDD
title: #p freq=noraman PBEPBE/SDD
converged: NO NO NO NO
title: Mulliken charges:
elementType: Br F F F C
charge: 0.109541 -0.121073 -0.121106 -0.121082 0.253721
chargesum: 0.00000
title: Mulliken charges with hydrogens summed into heavy atoms:
polarizability: 4.08489994e+01 1.29515433e-03 1.64406190e+01 -1.70223776e-03 6.74504238e-04 1.64344323e+01
1716.lowfreq: -20.9485 -13.5431 -13.2616 -0.0007 0.0008 0.0011 265.3433 265.6586 310.6302
frequency: 265.3390 265.6563 310.6302 467.0294 467.3724 651.6869 945.5525 1053.2003 1053.6483
redmass: 19.7645 19.7652 28.0727 18.0488 18.0503 17.1187 13.6174 13.2574 13.2563
irintensity: 0.1157 0.1143 0.6903 2.7736 2.7482 49.7541 472.6043 298.4597 298.4498
temp: 298.150 k
press: 1.00000 atm
elementType: 35 9 9 9 6
symmnumber: 1
zpe: 32778.4 jmol-1
zpe.correction: 0.012485 hartree
zpe.thermalcorrener: 0.017392 hartree
zpe.thermalcorrenthalpy: 0.018337 hartree
zpe.thermalcorrgfe: -0.017222 hartree
zpe.sumelectzpe: -350.676118 hartree
zpe.sumelectthermal: -350.671211 hartree
zpe.sumelectthermalent: -350.670266 hartree
zpe.sumelectthermalfe: -350.705825 hartree
dipole: -0.9845 0.0001 -0.0004
dipole: 0.9845
quadrupole: -34.6436 -37.1248 -37.1243
quadrupole: 0.0003 -0.0002 0.0001
quadrupole: 1.6540 -0.8273 -0.8267 0.0003 -0.0002 0.0001
hfenergy: -350.688603 hartree
pointgroup: C01 [X(C1Br1F3)]
dipole: -0.3873502 -0.0000644 0.0000127 debye
dipolederiv: -0.6141764 0.0001541 0.0000406 0.0002199 -0.0476769 0.0000235 0.0001173 0.0000181 -0.0476707 -0.5816173 0.2282229 -0.1353266 0.2627278 -0.6847708 0.2397277 -0.1559438 0.2398783 -0.4229522 -0.5813587 0.0032384 0.2652053 0.0035927 -0.2806668 -0.0064194 0.305546 -0.006574 -0.8270328 -0.5815089 -0.2312074 -0.129807 -0.2665126 -0.6959917 -0.2332312 -0.1496616 -0.2333154 -0.4116356 2.3586613 -0.000408 -0.0001123 -0.0000278 1.7091063 -0.0001006 -0.0000579 -0.000007 1.7092914 unknown
polarizability: 40.8489955|-0.0076059|16.4349549|-0.0063751|-0.0018428|16.4401003 unknown
InChI: InChI=1S/CBrF3/c2-1(3,4)5
charge 0 multiplicity 1
5 atoms
Br -1.889492 0.000335 0.000338
F  0.595865 -1.123233 0.666508
F  0.595545 -0.015529 -1.306231
F  0.59561 1.138568 0.63949
C  0.102472 -0.000141 -0.000105
