program: Orca
programVersion: 5.0.4
elementType: Cl O O N C C C C C C C C C C C C H H H H H H H H H H H H H H
charge: 0
multiplicity: 1
keywords: wb97x-d3
keywords: def2-TZVPP
keywords: def2/J RIJCOSX
keywords: DEFGRID2
keywords: scfconv7
keywords: smallprint printgap noloewdin
keywords: NOSOSCF
formula: C12H14ClNO2
InChI: InChI=1/C12H14ClNO2/c1-12(2)8-16-14(11(12)15)7-9-5-3-4-6-10(9)13/h3-6H,7-8H2,1-2H3
30 atoms
Cl 2.354253 -0.881815 2.031052
O  -1.494495 -1.080491 -1.738416
O  -1.311893 -0.179194 1.568374
N  -0.973156 -1.180741 -0.445001
C  -2.89794 0.099382 -0.291971
C  -2.877448 -0.796908 -1.524307
C  -1.660131 -0.406107 0.421224
C  -2.659533 1.567872 -0.651407
C  -4.150547 -0.066987 0.548921
C  0.442166 -1.456455 -0.368247
C  1.294985 -0.212099 -0.3937
C  2.16105 0.138887 0.638426
C  1.222617 0.650028 -1.489176
C  2.919683 1.30151 0.593906
C  1.968781 1.814364 -1.547591
C  2.819464 2.141963 -0.500973
H  -3.424088 -1.729416 -1.343545
H  -3.259348 -0.324321 -2.427898
H  -1.776589 1.701083 -1.279007
H  -3.52022 1.956391 -1.197207
H  -2.528573 2.173033 0.245779
H  -5.027374 0.256663 -0.013235
H  -4.303506 -1.106441 0.841284
H  -4.097136 0.536929 1.454618
H  0.692544 -2.112454 -1.201388
H  0.611998 -2.039201 0.533743
H  0.57203 0.398533 -2.316383
H  3.582809 1.547965 1.411831
H  1.890605 2.461168 -2.41082
H  3.409311 3.04803 -0.534339
elementType: Cl O N C H
totalener: -1131.15236645 hartree
nucrepener: 1249.97522526 hartree
electener: -2381.12759171 hartree
oneelecener: -4031.06361435 hartree
twoeener: 1649.93602264 hartree
cpcmener: -0.02988949 hartree
kineticenergy: 1127.56840689 hartree
xcener: -86.124441341201 hartree
chargesum: -0.0000000
charge: -0.093168 -0.287557 -0.529007 0.035342 0.219705 -0.018743 0.203494 -0.316433 -0.305252 -0.016220 0.043673 0.015303 -0.218055 -0.137663 -0.139036 -0.165624 0.094404 0.108792 0.108599 0.109004 0.105835 0.109860 0.103055 0.095092 0.138678 0.118172 0.152261 0.140409 0.162824 0.162256
qa: -0.0932 -0.2876 -0.5290 0.0353 0.2197 -0.0187 0.2035 -0.3164 -0.3053 -0.0162 0.0437 0.0153 -0.2181 -0.1377 -0.1390 -0.1656 0.0944 0.1088 0.1086 0.1090 0.1058 0.1099 0.1031 0.0951 0.1387 0.1182 0.1523 0.1404 0.1628 0.1623
va: 1.2329 1.8926 1.9952 3.0541 3.7093 3.9847 4.2981 3.9413 3.9274 3.8211 3.5367 3.9092 3.8839 3.9605 3.9081 3.9282 1.0057 0.9933 1.0014 1.0009 1.0107 1.0002 1.0039 1.0118 1.0050 1.0199 1.0157 1.0064 0.9890 0.9875
dispcorr: -0.015074676 hartree
energy: -1131.167441129626
dipole: -18.85861 18.09685 -0.76176 7.69427 -7.26669 0.42758 -10.45456 8.21368 -2.24088
magnitude: 2.40512 au
magnitude: 6.11334 debye
