program: Orca
programVersion: 5.0.4
elementType: Cl O O N C C C C C C C C C C C C H H H H H H H H H H H H H H
charge: 0
multiplicity: 1
keywords: wb97x-d3
keywords: def2-TZVPP
keywords: def2/J RIJCOSX
keywords: DEFGRID2
keywords: scfconv7
keywords: smallprint printgap noloewdin
keywords: NOSOSCF
formula: C12H14ClNO2
InChI: InChI=1/C12H14ClNO2/c1-12(2)8-16-14(11(12)15)7-9-5-3-4-6-10(9)13/h3-6H,7-8H2,1-2H3
30 atoms
Cl 2.475129 -2.013398 -0.052702
O  -0.984014 -1.178392 -0.578294
O  -2.398403 1.032878 1.658634
N  -1.023125 -0.43796 0.592719
C  -3.005058 -0.002446 -0.495925
C  -1.93445 -0.545556 -1.435652
C  -2.141485 0.290569 0.725061
C  -3.662497 1.26204 -1.021985
C  -4.050065 -1.058074 -0.130208
C  0.200494 -0.386384 1.339766
C  1.280493 0.349759 0.588169
C  2.331127 -0.282698 -0.068834
C  1.218223 1.74088 0.517341
C  3.299758 0.437862 -0.755256
C  2.170688 2.474508 -0.168363
C  3.217527 1.819129 -0.802697
H  -2.293339 -1.294013 -2.141498
H  -1.447458 0.267357 -1.987758
H  -4.18264 1.05723 -1.958767
H  -4.396691 1.646883 -0.313952
H  -2.931382 2.049388 -1.211731
H  -4.658672 -1.299428 -1.003025
H  -3.595001 -1.984187 0.225278
H  -4.71813 -0.691485 0.650428
H  0.504595 -1.396644 1.614244
H  -0.029551 0.135044 2.268764
H  0.403339 2.250807 1.018427
H  4.111331 -0.078365 -1.250594
H  2.100499 3.553641 -0.204107
H  3.974398 2.37983 -1.33539
elementType: Cl O N C H
totalener: -1131.16065331 hartree
nucrepener: 1237.75198715 hartree
electener: -2368.91264046 hartree
oneelecener: -4006.01397873 hartree
twoeener: 1637.10133826 hartree
cpcmener: -0.02266792 hartree
kineticenergy: 1127.55917066 hartree
xcener: -86.124814634902 hartree
chargesum: -0.0000000
charge: -0.091452 -0.282992 -0.519838 0.066028 0.222720 -0.030087 0.200206 -0.317723 -0.323463 -0.044397 -0.003521 0.037079 -0.128462 -0.152014 -0.177350 -0.143503 0.106435 0.097488 0.108900 0.095851 0.102815 0.103208 0.110268 0.106413 0.129343 0.125518 0.145238 0.138549 0.158965 0.159776
qa: -0.0915 -0.2830 -0.5198 0.0660 0.2227 -0.0301 0.2002 -0.3177 -0.3235 -0.0444 -0.0035 0.0371 -0.1285 -0.1520 -0.1773 -0.1435 0.1064 0.0975 0.1089 0.0959 0.1028 0.1032 0.1103 0.1064 0.1293 0.1255 0.1452 0.1385 0.1590 0.1598
va: 1.2309 1.8870 2.0054 3.1125 3.6939 3.9910 4.3101 3.9507 3.9282 3.8328 3.5582 3.9107 3.8682 3.9853 3.9422 3.9082 0.9949 1.0023 1.0000 1.0121 1.0025 1.0003 1.0028 1.0066 1.0149 1.0225 1.0119 1.0072 0.9907 0.9881
dispcorr: -0.014380618 hartree
energy: -1131.175033932397
dipole: -18.93755 19.15853 0.22098 8.88277 -8.62506 0.25772 -5.06937 3.62693 -1.44244
magnitude: 1.48185 au
magnitude: 3.76656 debye
