program: Orca
programVersion: 5.0.4
elementType: Cl O O N C C C C C C C C C C C C H H H H H H H H H H H H H H
charge: 0
multiplicity: 1
keywords: wb97x-d3
keywords: def2-TZVPP
keywords: def2/J RIJCOSX
keywords: DEFGRID2
keywords: scfconv7
keywords: smallprint printgap noloewdin
keywords: NOSOSCF
formula: C12H14ClNO2
InChI: InChI=1/C12H14ClNO2/c1-12(2)8-16-14(11(12)15)7-9-5-3-4-6-10(9)13/h3-6H,7-8H2,1-2H3
30 atoms
Cl 1.788911 -1.479897 -1.047257
O  -1.224514 -1.798269 0.113579
O  -1.678844 1.565936 0.679572
N  -0.860894 -0.549327 0.592852
C  -2.810928 -0.227327 -0.584753
C  -2.075506 -1.499579 -0.993847
C  -1.744191 0.409129 0.293897
C  -3.170305 0.6578 -1.765163
C  -4.039174 -0.522628 0.277999
C  0.29919 -0.455874 1.441271
C  1.378291 0.412722 0.849247
C  2.108364 0.040461 -0.276833
C  1.669705 1.64339 1.428481
C  3.099179 0.852222 -0.805689
C  2.657377 2.469446 0.9145
C  3.371868 2.072379 -0.205312
H  -2.722733 -2.361546 -1.153204
H  -1.466842 -1.332117 -1.890585
H  -2.294447 0.908722 -2.365353
H  -3.88686 0.152036 -2.414473
H  -3.628968 1.589002 -1.431481
H  -4.814387 -0.997435 -0.325599
H  -3.807874 -1.190373 1.109915
H  -4.455588 0.396591 0.692142
H  0.659575 -1.468785 1.621066
H  0.004743 -0.050474 2.411436
H  1.108936 1.954888 2.301238
H  3.654302 0.535966 -1.678744
H  2.863621 3.421742 1.384771
H  4.144457 2.707729 -0.618014
elementType: Cl O N C H
totalener: -1131.15878633 hartree
nucrepener: 1254.77680177 hartree
electener: -2385.93558810 hartree
oneelecener: -4040.53984535 hartree
twoeener: 1654.60425725 hartree
cpcmener: -0.02388291 hartree
kineticenergy: 1127.57092947 hartree
xcener: -86.126523999648 hartree
chargesum: 0.0000000
charge: -0.089910 -0.271528 -0.522852 0.068970 0.236243 -0.036092 0.190277 -0.312684 -0.324710 -0.079648 0.050940 0.006599 -0.142075 -0.160055 -0.159464 -0.152046 0.108330 0.087194 0.102628 0.108068 0.096010 0.103351 0.110081 0.105655 0.150503 0.125781 0.140478 0.141230 0.158957 0.159768
qa: -0.0899 -0.2715 -0.5229 0.0690 0.2362 -0.0361 0.1903 -0.3127 -0.3247 -0.0796 0.0509 0.0066 -0.1421 -0.1601 -0.1595 -0.1520 0.1083 0.0872 0.1026 0.1081 0.0960 0.1034 0.1101 0.1057 0.1505 0.1258 0.1405 0.1412 0.1590 0.1598
va: 1.2391 1.8766 2.0135 3.0703 3.6703 3.9892 4.3325 3.9472 3.9387 3.8550 3.4899 3.9287 3.9050 3.9819 3.9225 3.9205 0.9960 1.0110 1.0023 1.0001 1.0124 1.0001 1.0027 1.0084 1.0013 1.0015 1.0091 1.0064 0.9900 0.9884
dispcorr: -0.014663722 hartree
energy: -1131.173450047890
dipole: -16.14062 16.17775 0.03713 5.45353 -6.14101 -0.68748 -0.21726 -0.11353 -0.33079
magnitude: 0.76382 au
magnitude: 1.94149 debye
