program: Orca
programVersion: 5.0.4
elementType: Cl O O N C C C C C C C C C C C C H H H H H H H H H H H H H H
charge: 0
multiplicity: 1
keywords: wb97x-d3
keywords: def2-TZVPP
keywords: def2/J RIJCOSX
keywords: DEFGRID2
keywords: scfconv7
keywords: smallprint printgap noloewdin
keywords: NOSOSCF
formula: C12H14ClNO2
InChI: InChI=1/C12H14ClNO2/c1-12(2)8-16-14(11(12)15)7-9-5-3-4-6-10(9)13/h3-6H,7-8H2,1-2H3
30 atoms
Cl 0.778872 1.093351 1.69903
O  -1.281366 -0.240955 -1.555458
O  -1.882549 -1.105243 1.72758
N  -0.935757 -0.767922 -0.321627
C  -3.054545 0.095984 -0.072931
C  -2.2955 0.707581 -1.246304
C  -1.916454 -0.669427 0.601197
C  -3.641618 1.131124 0.870936
C  -4.118192 -0.903038 -0.531754
C  0.389473 -1.286741 -0.203245
C  1.437717 -0.261763 -0.550526
C  1.682887 0.854396 0.244407
C  2.188511 -0.406439 -1.710331
C  2.647698 1.788586 -0.097556
C  3.158116 0.5164 -2.067137
C  3.38656 1.616943 -1.257209
H  -2.895619 0.850968 -2.145095
H  -1.83965 1.664503 -0.960761
H  -4.072288 0.648904 1.74741
H  -2.883077 1.833271 1.218524
H  -4.430807 1.700954 0.377378
H  -4.947069 -0.380426 -1.012549
H  -3.719765 -1.625535 -1.245226
H  -4.518716 -1.456052 0.317738
H  0.514501 -2.163118 -0.846727
H  0.483716 -1.627174 0.829263
H  2.000772 -1.262271 -2.346933
H  2.819211 2.642326 0.543405
H  3.72871 0.378573 -2.97542
H  4.140223 2.346108 -1.522748
totalener: -1131.14063222 hartree
nucrepener: 1260.42349701 hartree
electener: -2391.56412924 hartree
oneelecener: -4051.18171199 hartree
twoeener: 1659.61758275 hartree
kineticenergy: 1127.61411553 hartree
xcener: -86.132265763860 hartree
chargesum: -0.0000000
charge: -0.061335 -0.248668 -0.380153 0.045527 0.193883 -0.034669 0.133717 -0.284146 -0.319027 -0.067854 0.023921 0.015610 -0.108267 -0.131279 -0.126098 -0.123363 0.086972 0.079815 0.103753 0.087125 0.091961 0.088392 0.106169 0.110314 0.098124 0.136765 0.107325 0.120067 0.127147 0.128272
qa: -0.0613 -0.2487 -0.3802 0.0455 0.1939 -0.0347 0.1337 -0.2841 -0.3190 -0.0679 0.0239 0.0156 -0.1083 -0.1313 -0.1261 -0.1234 0.0870 0.0798 0.1038 0.0871 0.0920 0.0884 0.1062 0.1103 0.0981 0.1368 0.1073 0.1201 0.1271 0.1283
va: 1.2727 1.9020 2.1548 3.0389 3.7280 4.0199 4.3494 3.9506 3.9276 3.8761 3.5905 3.9871 3.9761 4.0003 3.9755 3.9655 0.9972 1.0043 1.0158 1.0115 1.0016 1.0024 1.0050 1.0090 1.0024 1.0174 1.0118 1.0141 1.0003 0.9986
dispcorr: -0.014874492 hartree
energy: -1131.155506716701
dipole: -13.11255 13.34875 0.23620 -0.54268 1.08506 0.54238 -8.72425 7.38410 -1.34015
magnitude: 1.46491 au
magnitude: 3.72351 debye
