program: Orca
programVersion: 5.0.4
elementType: Cl Cl O O N C C C C C C C C C C C C H H H H H H H H H H H H H
charge: 0
multiplicity: 1
keywords: wb97x-d3
keywords: def2-TZVPP
keywords: def2/J RIJCOSX
keywords: DEFGRID2
keywords: scfconv7
keywords: smallprint printgap noloewdin
keywords: NOSOSCF
formula: C12H13Cl2NO2
InChI: InChI=1/C12H13Cl2NO2/c1-12(2)7-17-15(11(12)16)6-8-3-4-9(13)5-10(8)14/h3-5H,6-7H2,1-2H3
30 atoms
Cl -1.075529 2.781593 -0.311825
Cl -4.355163 -1.410076 -0.800761
O  1.824017 1.040012 -0.693685
O  2.787553 -1.181944 1.757788
N  1.843741 0.541657 0.602609
C  3.357311 -0.721439 -0.595531
C  2.366848 -0.006983 -1.504077
C  2.650876 -0.524083 0.737297
C  3.509175 -2.195117 -0.927397
C  4.717528 -0.021892 -0.550519
C  0.725746 0.923952 1.42385
C  -0.567954 0.38665 0.874779
C  -1.426764 1.129509 0.071771
C  -0.915425 -0.936576 1.135618
C  -2.595187 0.590263 -0.44697
C  -2.069753 -1.505581 0.629083
C  -2.901954 -0.727692 -0.160154
H  2.815075 0.45423 -2.382933
H  1.56383 -0.683213 -1.818652
H  4.172452 -2.689382 -0.217533
H  2.549693 -2.71345 -0.916704
H  3.942721 -2.312307 -1.921016
H  5.236816 -0.16302 -1.498949
H  4.624693 1.050556 -0.376487
H  5.343144 -0.439078 0.238784
H  0.708585 2.00758 1.533998
H  0.913877 0.513031 2.414627
H  -0.260522 -1.535985 1.755902
H  -3.249514 1.189767 -1.064264
H  -2.315893 -2.534886 0.849307
elementType: Cl O N C H
totalener: -1590.76390348 hartree
nucrepener: 1463.60283586 hartree
electener: -3054.36673934 hartree
oneelecener: -5091.41813980 hartree
twoeener: 2037.05140045 hartree
cpcmener: -0.02652375 hartree
kineticenergy: 1586.56668310 hartree
xcener: -106.947653050821 hartree
chargesum: -0.0000000
charge: -0.078885 -0.084571 -0.293914 -0.546031 0.063890 0.234807 -0.031146 0.215161 -0.318184 -0.323799 -0.041648 0.000280 0.004016 -0.131613 -0.110523 -0.162416 0.081559 0.111719 0.101436 0.095059 0.104691 0.109873 0.105239 0.110348 0.107425 0.133801 0.125423 0.146343 0.124112 0.147549
qa: -0.0789 -0.0846 -0.2939 -0.5460 0.0639 0.2348 -0.0311 0.2152 -0.3182 -0.3238 -0.0416 0.0003 0.0040 -0.1316 -0.1105 -0.1624 0.0816 0.1117 0.1014 0.0951 0.1047 0.1099 0.1052 0.1103 0.1074 0.1338 0.1254 0.1463 0.1241 0.1475
va: 1.2403 1.2182 1.8858 1.9663 3.1152 3.6856 3.9861 4.2855 3.9481 3.9280 3.8384 3.5587 3.9668 3.9032 4.0262 4.0194 3.8697 0.9958 1.0026 1.0119 1.0019 1.0005 1.0001 1.0031 1.0058 1.0113 1.0217 1.0118 1.0191 1.0033
dispcorr: -0.015517334 hartree
energy: -1590.779420812269
dipole: 31.25879 -30.99181 0.26698 -9.30356 9.24680 -0.05676 -1.36247 0.29190 -1.07057
magnitude: 1.10481 au
magnitude: 2.80822 debye
