program: Orca
programVersion: 5.0.4
elementType: Cl Cl O O N C C C C C C C C C C C C H H H H H H H H H H H H H
charge: 0
multiplicity: 1
keywords: wb97x-d3
keywords: def2-TZVPP
keywords: def2/J RIJCOSX
keywords: DEFGRID2
keywords: scfconv7
keywords: smallprint printgap noloewdin
keywords: NOSOSCF
formula: C12H13Cl2NO2
InChI: InChI=1/C12H13Cl2NO2/c1-12(2)7-17-15(11(12)16)6-8-3-4-9(13)5-10(8)14/h3-5H,6-7H2,1-2H3
30 atoms
Cl -1.24435 2.658225 -0.601118
Cl -4.231746 -1.764299 -0.512432
O  2.284944 -0.609161 1.573371
O  2.023991 1.3141 -1.259975
N  1.912506 0.544619 0.880283
C  3.25951 -0.687443 -0.543386
C  3.48949 -1.020568 0.924218
C  2.340156 0.509347 -0.400572
C  4.537007 -0.348553 -1.289627
C  2.471327 -1.789608 -1.257202
C  0.698981 1.166535 1.349759
C  -0.55049 0.469079 0.872708
C  -1.462626 1.043239 -0.009218
C  -0.831245 -0.821079 1.322645
C  -2.598017 0.369596 -0.438958
C  -1.949941 -1.520522 0.908215
C  -2.824449 -0.914089 0.02155
H  3.625689 -2.08178 1.126629
H  4.339732 -0.460523 1.329769
H  4.324646 -0.059406 -2.318873
H  5.078859 0.467854 -0.810684
H  5.196017 -1.217227 -1.319578
H  1.552146 -2.049039 -0.728399
H  2.20307 -1.485337 -2.269121
H  3.082498 -2.690281 -1.327122
H  0.728799 2.205783 1.032083
H  0.734041 1.18051 2.4391
H  -0.166592 -1.292285 2.033618
H  -3.290097 0.842807 -1.121616
H  -2.137061 -2.517841 1.280744
elementType: Cl O N C H
totalener: -1590.76318342 hartree
nucrepener: 1468.53882486 hartree
electener: -3059.30200828 hartree
oneelecener: -5101.85498763 hartree
twoeener: 2042.55297934 hartree
cpcmener: -0.02837006 hartree
kineticenergy: 1586.55602855 hartree
xcener: -106.943032223019 hartree
chargesum: -0.0000000
charge: -0.079276 -0.084964 -0.288057 -0.523422 0.040878 0.207725 -0.016210 0.210121 -0.306268 -0.310688 -0.016798 0.012336 0.026933 -0.208299 -0.117355 -0.129234 0.072215 0.106679 0.095175 0.094992 0.103202 0.110037 0.107460 0.105646 0.107095 0.112979 0.140105 0.151066 0.126587 0.149341
qa: -0.0793 -0.0850 -0.2881 -0.5234 0.0409 0.2077 -0.0162 0.2101 -0.3063 -0.3107 -0.0168 0.0123 0.0269 -0.2083 -0.1174 -0.1292 0.0722 0.1067 0.0952 0.0950 0.1032 0.1100 0.1075 0.1056 0.1071 0.1130 0.1401 0.1511 0.1266 0.1493
va: 1.2425 1.2182 1.8958 2.0007 3.0689 3.7192 3.9885 4.2993 3.9268 3.9429 3.8312 3.5884 3.9387 3.9392 4.0261 3.9826 3.8845 0.9937 1.0055 1.0118 1.0037 1.0001 1.0003 1.0102 1.0015 1.0231 1.0038 1.0133 1.0190 1.0021
dispcorr: -0.015782118 hartree
energy: -1590.778965541958
dipole: 30.92174 -29.74803 1.17371 -9.73533 8.13659 -1.59874 1.07407 0.44967 1.52374
magnitude: 2.50107 au
magnitude: 6.35721 debye
