program: Orca
programVersion: 5.0.4
elementType: Cl Cl O O N C C C C C C C C C C C C H H H H H H H H H H H H H
charge: 0
multiplicity: 1
keywords: wb97x-d3
keywords: def2-TZVPP
keywords: def2/J RIJCOSX
keywords: DEFGRID2
keywords: scfconv7
keywords: smallprint printgap noloewdin
keywords: NOSOSCF
formula: C12H13Cl2NO2
InChI: InChI=1/C12H13Cl2NO2/c1-12(2)7-17-15(11(12)16)6-8-3-4-9(13)5-10(8)14/h3-5H,6-7H2,1-2H3
30 atoms
Cl -1.346603 2.690649 -0.628842
Cl -4.235125 -1.796136 -0.439027
O  2.37675 -0.438863 1.626988
O  1.962877 1.106597 -1.412812
N  1.932209 0.597024 0.804209
C  3.336972 -0.712742 -0.485314
C  3.592811 -0.865105 1.008797
C  2.344458 0.433203 -0.469105
C  4.590249 -0.377759 -1.274043
C  2.621711 -1.934787 -1.067818
C  0.708362 1.234607 1.218816
C  -0.534246 0.50022 0.778758
C  -1.504005 1.065261 -0.045162
C  -0.753915 -0.807765 1.210679
C  -2.645892 0.37233 -0.424517
C  -1.876052 -1.527315 0.842974
C  -2.816816 -0.923813 0.024476
H  3.781513 -1.888735 1.328475
H  4.418395 -0.223741 1.336895
H  5.082464 0.5148 -0.886485
H  5.300294 -1.203958 -1.21973
H  4.358285 -0.210565 -2.325813
H  3.289179 -2.796987 -1.042707
H  1.72045 -2.192771 -0.508136
H  2.33496 -1.761347 -2.105267
H  0.730324 2.251425 0.834513
H  0.732994 1.32303 2.30498
H  -0.034708 -1.280316 1.865667
H  -3.384487 0.839658 -1.061086
H  -2.015519 -2.538064 1.200115
elementType: Cl O N C H
totalener: -1590.76336355 hartree
nucrepener: 1464.01969196 hartree
electener: -3054.78305551 hartree
oneelecener: -5092.78993765 hartree
twoeener: 2038.00688214 hartree
cpcmener: -0.02906254 hartree
kineticenergy: 1586.55267891 hartree
xcener: -106.943051997294 hartree
chargesum: 0.0000000
charge: -0.079195 -0.084940 -0.287035 -0.532261 0.038928 0.213369 -0.015569 0.214720 -0.308186 -0.314485 -0.021377 0.036293 0.007218 -0.216402 -0.114267 -0.127044 0.070878 0.107327 0.094755 0.103648 0.110196 0.095243 0.107702 0.108658 0.105543 0.116566 0.140025 0.153972 0.126707 0.149013
qa: -0.0792 -0.0849 -0.2870 -0.5323 0.0389 0.2134 -0.0156 0.2147 -0.3082 -0.3145 -0.0214 0.0363 0.0072 -0.2164 -0.1143 -0.1270 0.0709 0.1073 0.0948 0.1036 0.1102 0.0952 0.1077 0.1087 0.1055 0.1166 0.1400 0.1540 0.1267 0.1490
va: 1.2438 1.2179 1.8925 1.9911 3.0706 3.7149 3.9847 4.2914 3.9273 3.9437 3.8316 3.5698 3.9546 3.9317 4.0182 3.9862 3.8800 0.9935 1.0053 1.0036 0.9999 1.0118 1.0010 0.9999 1.0102 1.0199 1.0035 1.0141 1.0185 1.0025
dispcorr: -0.015709960 hartree
energy: -1590.779073511424
dipole: 31.90673 -30.58662 1.32012 -9.75186 8.32352 -1.42834 1.44462 0.20604 1.65065
magnitude: 2.55098 au
magnitude: 6.48408 debye
