program: Orca
programVersion: 5.0.4
elementType: Cl Cl O O N C C C C C C C C C C C C H H H H H H H H H H H H H
charge: 0
multiplicity: 1
keywords: wb97x-d3
keywords: def2-TZVPP
keywords: def2/J RIJCOSX
keywords: DEFGRID2
keywords: scfconv7
keywords: smallprint printgap noloewdin
keywords: NOSOSCF
formula: C12H13Cl2NO2
InChI: InChI=1/C12H13Cl2NO2/c1-12(2)7-17-15(11(12)16)6-8-3-4-9(13)5-10(8)14/h3-5H,6-7H2,1-2H3
30 atoms
Cl -0.795401 0.999141 2.459075
Cl -4.379714 -1.662347 -0.470465
O  1.78655 0.494047 -1.785226
O  2.533795 0.562383 1.573293
N  1.726741 1.044705 -0.507894
C  3.25349 -0.688444 -0.416037
C  3.060723 -0.146398 -1.825084
C  2.484483 0.357265 0.375807
C  2.536582 -2.027758 -0.222601
C  4.70925 -0.772747 0.002183
C  0.539309 1.81832 -0.254837
C  -0.715181 0.978717 -0.264379
C  -1.360228 0.538378 0.888884
C  -1.263022 0.590254 -1.485739
C  -2.488646 -0.268148 0.838486
C  -2.381897 -0.219009 -1.569226
C  -2.98198 -0.647179 -0.396828
H  3.837253 0.585251 -2.078974
H  3.020028 -0.910658 -2.600646
H  1.493411 -1.986333 -0.542252
H  3.03416 -2.803277 -0.807184
H  2.554732 -2.334099 0.823976
H  5.214628 0.189394 -0.094735
H  4.801651 -1.099906 1.038105
H  5.24154 -1.494012 -0.620086
H  0.469902 2.596062 -1.01713
H  0.688982 2.324086 0.696764
H  -0.807744 0.939179 -2.403391
H  -2.970529 -0.592676 1.750531
H  -2.778003 -0.505007 -2.533728
elementType: Cl O N C H
totalener: -1590.77127148 hartree
nucrepener: 1469.03426636 hartree
electener: -3059.80553784 hartree
oneelecener: -5102.73893203 hartree
twoeener: 2042.93339419 hartree
cpcmener: -0.02288383 hartree
kineticenergy: 1586.55092965 hartree
xcener: -106.942047648209 hartree
chargesum: 0.0000000
charge: -0.073440 -0.083312 -0.284489 -0.487991 0.058565 0.195629 -0.017028 0.199222 -0.312201 -0.305233 -0.041247 -0.015806 0.042490 -0.169504 -0.112699 -0.138451 0.069321 0.090633 0.103551 0.105632 0.103963 0.106467 0.101358 0.095753 0.107145 0.136334 0.110530 0.143507 0.124856 0.146444
qa: -0.0734 -0.0833 -0.2845 -0.4880 0.0586 0.1956 -0.0170 0.1992 -0.3122 -0.3052 -0.0412 -0.0158 0.0425 -0.1695 -0.1127 -0.1385 0.0693 0.0906 0.1036 0.1056 0.1040 0.1065 0.1014 0.0958 0.1071 0.1363 0.1105 0.1435 0.1249 0.1464
va: 1.2501 1.2196 1.9016 2.0432 3.0646 3.7286 3.9950 4.3120 3.9424 3.9301 3.8672 3.5894 3.9199 3.9594 4.0174 3.9872 3.8914 1.0046 0.9933 1.0025 1.0019 1.0096 1.0040 1.0123 1.0004 1.0001 1.0287 1.0108 1.0197 1.0028
dispcorr: -0.015600782 hartree
energy: -1590.786872261732
dipole: 29.39689 -28.83619 0.56070 -3.76269 3.59809 -0.16460 -10.52922 8.37480 -2.15442
magnitude: 2.23226 au
magnitude: 5.67396 debye
