program: Gaussian 09
title: 000055701
version: EM64L-G09RevD.01
frameworkgroup: C1[X(C19H26NO4)]
method: RPBEPBE
basis: SDD
operation: Freq
keyword: #p
keyword: freq=noraman
keyword: PBEPBE/SDD
title: #p freq=noraman PBEPBE/SDD
converged: YES YES NO NO
title: Mulliken charges:
elementType: O O O O N C C C C C C C C C C C C C C C C C C C H H H H H H H H H H H H H H H H H H H H H H H H H H
charge: -0.506212 -0.332928 -0.242700 -0.243823 -0.114110 -0.361100 -0.468334 -0.067334 -0.561843 -0.570848 -0.325164 0.253481 0.269994 0.157458 -0.232301 0.425462 -0.372884 -0.375086 -0.437698 -0.243422 -0.410241 -0.654755 -0.228822 -0.231568 0.254960 0.306573 0.344075 0.295010 0.247420 0.338496 0.250615 0.246931 0.307925 0.257422 0.262499 0.222898 0.231278 0.403236 0.247767 0.246013 0.243145 0.237364 0.251174 0.237851 0.250433 0.238625 0.238503 0.237649 0.235615 0.241305
chargesum: 1.00000
title: Mulliken charges with hydrogens summed into heavy atoms:
elementType: O O O O N C C C C C C C C C C C C C C C C C C C
charge: -0.102976 -0.332928 -0.242700 -0.243823 -0.114110 0.200434 0.170751 0.180085 0.274198 0.256997 0.129012 0.253481 0.269994 0.157458 0.261479 0.425462 -0.129739 -0.137722 -0.186524 -0.005571 -0.159807 0.060022 0.006793 0.009736
polarizability: 2.70306463e+02 1.39320795e+01 2.36193104e+02 -5.60722954e+00 4.34455478e+01 1.76307657e+02
1716.lowfreq: -4.8243 -0.0008 -0.0005 0.0005 1.8446 6.9112 11.1161 17.8025 23.0743
frequency: 10.9148 17.6319 22.9302 36.0844 48.4299 63.2623 82.7314 107.0645 115.0670 125.1968 147.2905 150.0753 173.7362 184.5640 189.4721 209.6697 232.0555 245.5401 262.6522 271.4745 284.4416 289.5028 300.1991 337.7590 361.1913 366.3555 384.9926 416.7443 427.9237 464.5673 466.9768 473.0523 498.5818 500.8751 530.3351 547.0281 558.1285 568.4735 573.5770 629.1019 633.9137 696.9477 723.4398 742.7823 747.8482 780.9370 782.8529 796.5849 803.8929 805.9944 836.0977 848.1162 866.6991 879.1785 879.9032 894.5622 918.4117 958.2772 963.8384 965.4052 972.8964 979.9761 1000.1772 1001.4404 1005.5300 1024.6745 1045.5298 1062.9091 1074.5453 1088.2841 1103.5612 1111.1942 1114.9747 1131.7740 1138.4748 1149.7065 1174.0075 1175.6764 1184.5053 1192.9697 1208.7645 1223.8864 1228.3274 1237.8696 1251.2139 1257.8381 1266.1625 1293.0741 1311.7742 1314.8178 1349.8698 1363.0811 1367.1596 1371.8554 1383.6956 1404.9966 1406.2250 1408.0328 1425.3555 1427.1362 1435.5645 1440.9441 1442.7050 1453.4657 1457.1312 1463.9432 1466.3277 1468.8937 1472.0036 1476.9950 1481.9180 1486.5335 1504.9204 1516.4156 1582.8748 1600.0879 1628.0430 1639.6801 2961.2682 2985.7404 3005.6358 3019.6091 3025.5374 3026.6939 3029.5306 3032.3253 3039.6930 3091.2183 3100.4135 3101.9597 3120.9313 3121.6305 3133.3649 3136.9216 3139.8938 3141.3247 3141.9775 3152.4836 3153.9458 3157.6616 3158.9054 3171.2906 3172.6348 3486.5174
redmass: 4.3254 4.0118 3.8340 3.4239 4.3772 6.8871 5.3855 3.5879 2.7300 3.4388 3.6255 4.3072 3.1884 3.6631 2.6439 3.5246 1.0975 1.3639 4.2279 3.9128 1.5043 3.9606 2.1501 3.8658 2.4172 3.4529 3.2841 3.1126 3.2671 3.8253 2.7464 2.7455 3.8670 3.0724 4.0534 2.5232 1.3841 3.1322 3.8787 4.8301 3.2693 6.0228 5.7019 1.3517 4.5303 1.6925 5.3165 1.1009 1.8872 3.9872 3.5107 4.4423 1.4746 3.6721 3.4629 1.6075 2.3534 2.3760 1.6546 2.0259 3.3974 1.3647 1.3501 2.0193 2.2040 2.5394 2.2731 3.3696 1.7689 2.3778 2.1243 1.6203 2.1895 1.4446 1.7264 1.4938 1.7481 1.0829 1.2830 1.2297 2.4806 1.5218 1.9896 1.9845 1.1394 1.2160 1.6982 1.3194 1.2311 1.3031 1.2884 1.2090 1.4784 1.5042 1.7663 1.4584 3.9342 1.2432 3.8378 1.2611 1.1249 1.1030 2.5651 2.1984 1.1260 1.0387 1.0707 1.0770 1.1233 1.0597 1.0633 1.0514 1.0535 3.8167 7.5690 5.4995 8.3572 7.1204 1.0565 1.0837 1.0365 1.0319 1.0339 1.0577 1.0618 1.1038 1.0609 1.1073 1.1037 1.0983 1.1061 1.1043 1.0863 1.1053 1.0869 1.1046 1.0889 1.1069 1.0916 1.1058 1.0946 1.0994 1.0999 1.0649
irintensity: 0.0563 0.6029 0.7267 0.9085 0.1479 3.7751 2.6611 3.4440 3.0617 1.0531 3.6831 3.8163 2.6565 2.4964 11.5290 6.9689 0.4874 3.0730 4.0319 6.2067 3.6055 6.6152 5.1193 3.3885 1.1302 10.8577 11.6391 6.7093 1.1663 0.8390 0.7582 0.9721 2.2810 0.4205 7.0870 23.4251 91.9587 22.1714 6.5623 17.7337 0.3747 2.6059 35.5507 2.0008 6.5936 85.1067 0.2372 4.7576 42.8481 34.3565 16.8714 11.9208 0.3543 28.3363 66.3643 4.0109 8.9508 18.8615 4.6621 8.1157 21.5507 3.0493 0.6311 29.0048 75.1309 18.6320 59.8411 114.2089 28.6470 51.8247 9.8578 15.3242 1.0289 8.2849 22.4338 12.9972 171.7486 3.0335 37.3950 6.4825 188.0499 36.5890 106.3300 25.0616 0.6982 38.5895 18.8936 1.0523 13.0707 28.3571 23.2606 4.5903 30.1750 37.7618 13.0376 10.3587 23.4877 26.5951 14.5206 25.2468 5.7510 14.8393 7.3945 40.9268 13.7357 16.7815 45.9667 5.2217 22.2514 11.5350 14.2873 20.8381 65.5956 25.5926 38.9915 14.5174 169.8472 3.7985 35.3293 20.0649 7.1319 15.5154 10.9008 9.4296 18.8051 31.1484 16.4001 1.8768 5.1779 13.2066 1.1501 30.1523 0.6129 0.1905 1.2344 12.4812 2.8548 10.0827 18.8733 0.4579 30.2590 29.2759 4.5272 125.3138
temp: 298.150 k
press: 1.00000 atm
elementType: 8 8 8 8 7 6 6 6 6 6 6 6 6 6 6 6 6 6 6 6 6 6 6 6 1 1 1 1 1 1 1 1 1 1 1 1 1 1 1 1 1 1 1 1 1 1 1 1 1 1
symmnumber: 1
zpe: 1102136.5 jmol-1
zpe.correction: 0.419782 hartree
zpe.thermalcorrener: 0.444135 hartree
zpe.thermalcorrenthalpy: 0.445080 hartree
zpe.thermalcorrgfe: 0.362951 hartree
zpe.sumelectzpe: -1093.204369 hartree
zpe.sumelectthermal: -1093.180015 hartree
zpe.sumelectthermalent: -1093.179071 hartree
zpe.sumelectthermalfe: -1093.261199 hartree
dipole: -12.0597 -4.2812 1.3579
dipole: 12.8690
quadrupole: -53.8525 -101.1761 -135.2935
quadrupole: 10.5780 -8.0883 -0.3685
quadrupole: 42.9216 -4.4021 -38.5194 10.5780 -8.0883 -0.3685
hfenergy: -1093.6241507 hartree
pointgroup: C01 [X(C19H26N1O4)]
dipole: 4.8762963 -1.2362948 0.5724466 debye
polarizability: 272.7473478|-10.2843392|153.5945608|7.3079016|-6.6357458|256.4653152 unknown
InChI: InChI=1S/C19H26NO4/c1-4-23-19(22)13-20(2,3)12-16(21)14-24-18-11-7-9-15-8-5-6-10-17(15)18/h5-11,16,21H,4,12-14H2,1-3H3
charge 1 multiplicity 1
50 atoms
O  0.821792 -1.756305 -0.074628
O  -1.225318 -0.192352 0.675866
O  4.096891 1.13663 -1.898838
O  3.775042 1.501016 0.385089
N  3.566784 -1.376334 0.809979
C  2.341516 -0.819527 1.592782
C  3.699323 -0.780593 -0.596206
C  1.092348 -0.566088 0.738937
C  3.418364 -2.899301 0.646815
C  4.828685 -1.099844 1.634938
C  -0.122441 -0.254138 1.63371
C  3.859326 0.744435 -0.61382
C  -2.542634 0.004323 1.183563
C  -3.574584 0.041942 0.182557
C  4.263071 2.625454 -2.162063
C  -4.940509 0.217787 0.631747
C  -2.823429 0.148667 2.543238
C  -3.305495 -0.083022 -1.218913
C  -5.215712 0.358259 2.033548
C  -4.179348 0.328483 2.964207
C  -5.987038 0.250508 -0.3478
C  4.53022 2.778984 -3.651059
C  -4.350224 -0.045734 -2.146447
C  -5.701678 0.119426 -1.708355
H  2.137224 -1.567663 2.377741
H  2.663264 0.130546 2.045853
H  2.799632 -1.078738 -1.162025
H  4.576589 -1.246628 -1.075679
H  1.247271 0.309118 0.075439
H  2.461165 -3.096168 0.144673
H  3.426149 -3.356248 1.648345
H  4.271371 -3.274733 0.060198
H  4.969436 -0.013885 1.722818
H  5.689924 -1.565622 1.131017
H  4.697619 -1.54783 2.631926
H  -0.296866 -1.066875 2.369051
H  0.00126 0.711013 2.163914
H  -0.128893 -1.694473 -0.366688
H  5.097942 2.975945 -1.530859
H  3.331852 3.118833 -1.833681
H  -2.034026 0.131322 3.300407
H  -2.271115 -0.193999 -1.5571
H  -6.252023 0.492498 2.361361
H  -4.391063 0.441208 4.032128
H  -7.02079 0.382687 -0.008952
H  3.690309 2.393045 -4.252085
H  5.452147 2.253499 -3.950307
H  4.65554 3.851063 -3.88642
H  -4.137723 -0.139305 -3.216763
H  -6.510649 0.146413 -2.445662
