program: Gaussian 09
title: 000055571
version: EM64L-G09RevD.01
frameworkgroup: C1[X(C19H10O)]
method: RPBEPBE
basis: SDD
operation: Freq
keyword: #pfreq=noraman
keyword: PBEPBE/SDD
title: #p freq=noraman PBEPBE/SDD
converged: NO YES NO NO
title: Mulliken charges:
elementType: O C C C C C C C C C C C C C C C C C C C H H H H H H H H H H
charge: -0.154754 -0.191370 -0.153941 0.037315 0.398764 0.585515 0.304253 0.522743 -0.226706 0.452324 -0.735923 -0.460661 -0.433161 -0.444647 -0.421131 -0.402606 -0.210918 -0.457297 -0.236317 -0.245188 0.253450 0.239865 0.236086 0.274015 0.244364 0.290334 0.225441 0.246308 0.232758 0.231085
chargesum: 0.00000
title: Mulliken charges with hydrogens summed into heavy atoms:
elementType: O C C C C C C C C C C C C C C C C C C C
charge: -0.154754 -0.191370 -0.153941 0.037315 0.398764 0.585515 0.304253 0.522743 -0.226706 0.452324 -0.482473 -0.220796 -0.197075 -0.170632 -0.176767 -0.112272 0.014523 -0.210989 -0.003559 -0.014103
polarizability: 3.69455304e+02 -1.82353059e+00 2.37411137e+02 1.73748374e-03 -2.63529015e-03 7.52345346e+01
1716.lowfreq: -5.1429 -0.0008 0.0002 0.0008 7.9293 10.5768 62.8584 107.9935 126.4284
frequency: 62.8530 107.9877 126.4279 170.3358 175.4915 206.5748 277.8041 280.1111 319.9918 345.4845 367.5293 404.3933 435.3028 443.6346 496.1127 510.3280 512.6345 530.9126 550.1970 557.2043 601.8431 620.0377 627.6067 669.2125 680.5450 733.0700 755.0875 772.9691 774.6162 778.1014 818.9223 841.2838 856.2104 860.2482 875.3798 882.1458 936.5460 939.2381 943.2893 976.3841 983.2711 991.4858 996.7071 1003.7591 1009.4496 1024.0683 1051.2791 1124.1032 1147.6491 1172.0121 1174.7259 1189.2807 1220.9476 1224.7150 1252.5852 1283.3838 1304.9801 1336.6129 1376.3010 1388.1097 1405.8975 1423.1513 1428.6910 1441.7885 1476.3615 1488.9318 1492.9444 1539.5323 1580.4395 1590.9527 1604.5189 1632.9209 1637.2372 1648.6419 3120.9325 3121.4477 3123.6670 3127.7105 3136.2083 3145.3090 3146.3544 3153.5355 3162.8029 3166.4333
redmass: 5.7831 4.2996 7.4815 4.8884 5.9467 4.0556 8.2824 4.1531 5.0179 7.5443 5.5917 3.9256 4.2893 5.8221 3.2162 6.4778 3.3360 7.2492 3.1646 7.1054 6.0660 4.1484 6.7101 8.3424 3.4396 6.6001 1.7420 1.9474 1.4965 5.4730 1.8038 3.5989 6.6625 2.5785 6.2030 1.4841 1.8835 1.4632 6.3578 1.3733 1.4378 1.4047 4.6152 1.3341 3.8304 2.4933 2.4781 1.9988 1.5161 1.2513 1.1075 1.3236 2.0622 1.7584 2.0404 1.9414 3.5819 3.2045 2.7711 2.9618 3.3597 3.1926 2.8283 2.8159 3.2877 7.7540 4.1084 5.9425 7.9042 8.9295 7.1147 9.3141 7.7103 8.9300 1.0887 1.0866 1.0893 1.0870 1.0893 1.0962 1.0928 1.0949 1.0976 1.1003
irintensity: 3.5982 0.1249 0.0598 0.8793 2.1887 2.1163 1.8781 0.5266 0.4700 0.9206 1.3753 0.6315 4.1769 1.0151 13.1001 2.9285 8.2812 8.1590 0.0159 0.0053 0.5435 0.3137 6.5683 0.0809 8.6462 2.0358 9.0951 8.5569 94.4516 15.8316 15.2522 9.5590 4.3902 24.6523 32.3125 19.7926 28.8733 1.2547 1.7164 3.8524 8.9992 0.4643 73.6243 0.3792 8.5474 1.7239 5.3077 4.0752 16.6944 7.4258 0.6073 16.1923 18.4950 3.7964 6.6616 0.2136 13.9111 5.9840 0.4500 0.9066 4.6158 4.9176 1.5380 3.7899 11.4158 4.6201 28.5141 12.7943 66.2460 141.3060 12.6340 49.0668 8.8773 4.4149 0.4461 0.0881 9.8982 3.0471 14.8484 22.5237 29.0958 17.6484 31.9503 30.6185
temp: 298.150 k
press: 1.00000 atm
elementType: 8 6 6 6 6 6 6 6 6 6 6 6 6 6 6 6 6 6 6 6 1 1 1 1 1 1 1 1 1 1
symmnumber: 1
zpe: 591409.1 jmol-1
zpe.correction: 0.225256 hartree
zpe.thermalcorrener: 0.238365 hartree
zpe.thermalcorrenthalpy: 0.239309 hartree
zpe.thermalcorrgfe: 0.186041 hartree
zpe.sumelectzpe: -803.980403 hartree
zpe.sumelectthermal: -803.967293 hartree
zpe.sumelectthermalent: -803.966349 hartree
zpe.sumelectthermalfe: -804.019618 hartree
dipole: -0.5102 3.6215 0.0004
dipole: 3.6572
quadrupole: -87.4873 -109.7643 -120.3907
quadrupole: 1.1626 -0.0007 0.0003
quadrupole: 18.3935 -3.8835 -14.5099 1.1626 -0.0007 0.0003
hfenergy: -804.2056586 hartree
pointgroup: C01 [X(C19H10O1)]
dipole: -0.2056452 -1.4240877 -0.000143 debye
polarizability: 369.4663376|1.3668281|237.4001036|-0.0017466|-0.0026293|75.2345346 unknown
InChI: InChI=1S/C19H10O/c20-19-15-7-3-5-11-8-9-13-10-12-4-1-2-6-14(12)18(19)17(13)16(11)15/h1-10H
charge 0 multiplicity 1
30 atoms
O  -0.026684 3.125946 -0.000252
C  -0.339537 -0.437604 -0.000007
C  -1.713076 -0.038151 -0.000036
C  0.511502 0.68036 -0.000077
C  -1.818379 1.372539 -0.000128
C  0.045899 -1.803851 -0.000099
C  1.917637 0.46421 -0.000211
C  -2.775721 -0.95833 -0.000162
C  -0.382183 1.915518 -0.000027
C  2.371384 -0.938669 -0.000257
C  1.446181 -2.032758 -0.000198
C  -1.05223 -2.768162 -0.000142
C  -2.390192 -2.368753 -0.000171
C  -3.099017 1.937015 -0.000343
C  -4.084429 -0.366198 -0.000334
C  2.892079 1.517596 -0.000264
C  -4.223582 1.039513 -0.000435
C  3.789187 -1.18975 -0.000362
C  4.255205 1.220308 -0.000373
C  4.707688 -0.14202 -0.000416
H  1.846275 -3.054757 -0.000288
H  -0.814617 -3.838765 -0.000175
H  -3.17592 -3.133858 -0.000224
H  -3.253452 3.020891 -0.000445
H  -4.980597 -0.998133 -0.000438
H  2.536321 2.552774 -0.000234
H  -5.232711 1.466849 -0.000597
H  4.13886 -2.229131 -0.00039
H  4.99087 2.032224 -0.000424
H  5.782439 -0.353852 -0.000492
