program: Orca
programVersion: 5.0.2
elementType: Cl O O N C C C C C C C C C C H H H H H H H H H H H H
charge: 0
multiplicity: 1
keywords: wb97x-d3
keywords: def2-TZVPP
keywords: def2/J RIJCOSX
keywords: DEFGRID2
keywords: scfconv7
keywords: smallprint printgap noloewdin
keywords: NOSOSCF
formula: C10H12ClNO2
InChI: InChI=1/C10H12ClNO2/c1-7(2)14-10(13)12-9-5-3-4-8(11)6-9/h3-7,12H,1-2H3
26 atoms
Cl -2.693657 -2.017656 0.788578
O  1.871718 -0.084062 0.118186
O  2.895839 1.803701 -0.545519
N  0.652138 1.687096 -0.528953
C  3.13065 -0.768392 0.345228
C  2.840251 -1.861791 1.348633
C  3.669133 -1.309566 -0.962188
C  -0.643324 1.192555 -0.367349
C  1.88921 1.156682 -0.32635
C  -0.970951 -0.07989 0.101742
C  -1.674859 2.072394 -0.711534
C  -2.309127 -0.429802 0.207935
C  -2.997409 1.69146 -0.592372
C  -3.339263 0.428871 -0.129225
H  3.838294 -0.060514 0.780142
H  3.770437 -2.373517 1.596099
H  2.428278 -1.460207 2.274762
H  2.14764 -2.605122 0.950424
H  2.97166 -2.017972 -1.411878
H  3.876428 -0.520155 -1.684409
H  0.696539 2.636288 -0.874396
H  -0.218033 -0.79702 0.382055
H  -1.434945 3.064098 -1.076052
H  -3.777954 2.389192 -0.86477
H  -4.37371 0.129566 -0.035453
H  4.605474 -1.836456 -0.776098
elementType: Cl O N C H
totalener: -1053.80594362 hartree
nucrepener: 970.32994502 hartree
electener: -2024.13588865 hartree
oneelecener: -3368.63613778 hartree
twoeener: 1344.50024913 hartree
cpcmener: -0.02406560 hartree
kineticenergy: 1050.55690388 hartree
xcener: -78.198401061984 hartree
chargesum: 0.0000000
charge: -0.094982 -0.300199 -0.541790 -0.149542 0.145384 -0.264092 -0.257297 0.143568 0.517247 -0.201572 -0.198057 0.105830 -0.124128 -0.203195 0.074870 0.103630 0.100033 0.090225 0.090859 0.092749 0.170199 0.148006 0.145238 0.162177 0.146153 0.098687
qa: -0.0950 -0.3002 -0.5418 -0.1495 0.1454 -0.2641 -0.2573 0.1436 0.5172 -0.2016 -0.1981 0.1058 -0.1241 -0.2032 0.0749 0.1036 0.1000 0.0902 0.0909 0.0927 0.1702 0.1480 0.1452 0.1622 0.1462 0.0987
va: 1.2130 2.1106 1.9557 3.2372 3.8026 3.9233 3.9099 3.9537 4.3080 3.9710 3.8926 3.8461 3.9219 3.9781 1.0216 1.0044 1.0086 1.0049 1.0062 1.0182 1.0220 1.0304 1.0040 0.9877 1.0040 1.0060
dispcorr: -0.010131783 hartree
energy: -1053.816075404737
dipole: 17.33597 -17.72498 -0.38901 -0.55452 0.65068 0.09616 -1.75818 1.66402 -0.09416
magnitude: 0.41163 au
magnitude: 1.04629 debye
